{"text_format":"1","workbook":"xlsx","n_sheets":3,"sheets":["Ausgabe","Eingabeliste","Daten"],"not_rendered":{"charts":0,"images":4,"macros":1,"external_links":0,"defined_names":2,"comments":0,"pivot_tables":0},"unopened":[],"bounds":{"document_bytes":16777216,"sheet_cells":100000,"rows_first":2000,"rows_last":500,"rows_between":2000,"halvings":0,"cell_chars":16384,"cell_head_chars":4096},"cells_cut":0,"cells_raw":0,"read":"whole","date_system":"1900"}

{"sheet":"Ausgabe","index":0,"n_rows":40,"n_cols":8,"rows_kept":40,"cut":false,"hidden":true,"merged":[[28,1,28,7],[29,1,29,3],[30,1,30,3],[31,1,31,3],[32,1,32,3],[24,1,24,7],[26,1,26,7],[9,6,9,7],[9,3,9,4],[10,3,10,4],[10,5,10,7],[40,1,40,3],[10,1,10,2],[7,1,7,2],[6,1,6,2],[27,2,27,3],[38,1,38,7],[39,1,39,7],[12,1,12,7],[15,1,15,7],[19,1,19,7],[25,2,25,3],[34,1,34,3],[35,1,35,3],[36,1,36,3],[37,1,37,3],[33,1,33,3],[0,1,0,5],[4,1,4,2],[9,1,9,2],[2,1,2,2],[1,1,1,2],[6,5,6,7],[4,3,4,7],[2,5,2,7],[1,3,1,7],[2,3,2,4]]}
[null,{"$f":"IF(Daten!J20=\"B\",\"Bestellung Standardzargen\",\"Preisanfrage Standardzargen \"& Daten!M10&\" / \"&Daten!M8)","v":"Preisanfrage Standardzargen OHNE Ausmass / OHNE Montage"}]
[null,"Firma",null,{"$f":"IF(Daten!L1=0,\"\",Daten!L1)","v":"Firmenname"}]
[null,"Ansprechperson",null,{"$f":"IF(Daten!L2=0,\"\",Daten!L2)","v":""},null,{"$f":"IF(Daten!L3=\"Telefonnummer\",\"\",Daten!L3)","v":""}]
[]
[null,"Objekt",null,{"$f":"IF(Daten!L4=0,\"\",Daten!L4)","v":""}]
[]
[null,"Lieferart",null,{"$f":"Daten!L9","v":"ab Werk"},null,{"$f":"IF(D7=\"ab Werk\",\"\",Daten!L6)","v":""}]
[{"$f":"IF(Daten!J20=\"O\",0,1)","v":0},"Wunschtermin",null,{"$f":"IF(Daten!L5=0,\"\",Daten!L5)","v":"??.??.??"}]
[]
[null,{"$f":"IF(Daten!B4=TRUE,\"Quetschbugzargen\",\"Spiegelzargen\")","v":"Quetschbugzargen"},null,{"$f":"Eingabeliste!B3&\" Stk (\"&COUNTA(Eingabeliste!A6:A106)&\" Positionen)\"","v":"0 Stk (0 Positionen)"}]
[null,"Oberfläche",null,{"$f":"Daten!H4","v":"Pulverbeschichtet RAL"},null,{"$f":"IF(D11=\"Farblos eloxiert\",\"\",Daten!H5&IF(Daten!H4=\"Pulverbeschichtet RAL\",IF(Daten!H6=FALSE,\" seidenglanz\",\" matt\"),\"\"))","v":"Farbton? seidenglanz"}]
[]
[null,"Leibungen"]
[{"$f":"IF(AND(D14=\"\",H14=\"\"),0,1)","v":1},"Spiegelbreite","SB",{"$f":"IF(Daten!B6=7,\"Quetschbug (7mm)\",Daten!B6)","v":"Quetschbug (7mm)"},null,{"$f":"IF(H14=\"\",\"\",\"Höhe Leibung\")","v":""},{"$f":"IF(H14=\"\",\"\",\"LH\")","v":""},{"$f":"IF(Daten!D1=\"Keine\",\"\",Daten!D7)","v":""}]
[{"$f":"IF(AND(D15=\"\",H15=\"\"),0,1)","v":1},"Breite Rinne","BF",{"$f":"Daten!B16","v":25},null,{"$f":"IF(H15=\"\",\"\",\"Tiefe Rinne\")","v":"Tiefe Rinne"},{"$f":"IF(F15=\"\",\"\",\"ET\")","v":"ET"},{"$f":"IF(Daten!B17=0,\"\",Daten!B17)","v":12}]
[null,"Sturzblech"]
[1,{"$f":"IF(D17=\"\",\"\",\"Tiefe bis Anschlag\")","v":"Tiefe bis Anschlag"},{"$f":"IF(D17=\"\",\"\",\"ST\")","v":"ST"},{"$f":"IF(Eingabeliste!W1=0,Daten!D2,\"\")","v":60},null,{"$f":"IF(H17=\"\",\"\",\"Tiefe Storenkasten\")","v":"Tiefe Storenkasten"},{"$f":"IF(H17=\"\",\"\",\"SL\")","v":"SL"},{"$f":"IF(Eingabeliste!X1=0,Daten!D6,\"\")","v":135}]
[1,{"$f":"IF(D18=\"\",\"\",\"Abstand Sturz\")","v":"Abstand Sturz"},{"$f":"IF(D18=\"\",\"\",\"AS\")","v":"AS"},{"$f":"IF(Eingabeliste!Y1=0,Daten!D3,\"\")","v":3}]
[1,"Höhe Sturz vorne","HS2",{"$f":"Daten!D4","v":35},null,{"$f":"IF(H19=\"\",\"\",\"Höhe Sturz hinten\")","v":""},{"$f":"IF(H19=\"\",\"\",\"HS1\")","v":""},{"$f":"IF(Daten!D1=\"Keine\",\"\",Daten!D5)","v":""}]
[1,{"$f":"IF(Daten!F1=\"Keine\",\"Ohne Fensterbänke (Alles Türzargen)\",IF(Daten!F9=TRUE,\"Fensterbänke geschlossen\",\"Fensterbänke\"))","v":"Ohne Fensterbänke (Alles Türzargen)"}]
[{"$f":"IF(SUM(A22:A24)=0,1,0)","v":1}]
[{"$f":"IF(Daten!F$1=\"Keine\",0,IF(AND(D22=\"\",H22=\"\"),0,1))","v":0},{"$f":"IF(D22=\"\",\"\",\"Abbordung vorne\")","v":"Abbordung vorne"},{"$f":"IF(D22=\"\",\"\",\"Va\")","v":"Va"},{"$f":"IF(Eingabeliste!AF1=0,Daten!F5,\"\")","v":50},null,{"$f":"IF(H22=\"\",\"\",\"Aufbordung hinten\")","v":"Aufbordung hinten"},{"$f":"IF(H22=\"\",\"\",\"Ha\")","v":"Ha"},{"$f":"IF(Eingabeliste!AG1=0,Daten!F4,\"\")","v":12}]
[{"$f":"IF(Daten!F$1=\"Keine\",0,IF(AND(D23=\"\",H23=\"\"),0,1))","v":0},"Gefälle","α",{"$f":"IF(Eingabeliste!AH1=0,Daten!F6,\"\")","v":5}]
[{"$f":"IF(Daten!F$1=\"Keine\",0,IF(AND(D24=\"\",H24=\"\"),0,1))","v":0},{"$f":"IF(D24=\"\",\"\",\"Überstand Leibung\")","v":"Überstand Leibung"},{"$f":"IF(D24=\"\",\"\",\"Ue\")","v":"Ue"},{"$f":"IF(Eingabeliste!AI1=0,Daten!F2,\"\")","v":10},null,{"$f":"IF(H24=\"\",\"\",\"Versatz zu Anschlag\")","v":"Versatz zu Anschlag"},{"$f":"IF(H24=\"\",\"\",\"VFB\")","v":"VFB"},{"$f":"IF(Eingabeliste!AJ1=0,Daten!F3,\"\")","v":0}]
[{"$f":"IF(Daten!D1=\"Keine\",0,IF(Daten!D15=TRUE,1,0))","v":0},"Rahmendämmung"]
[{"$f":"A25","v":0},"Isolationsmaterial",{"$f":"Daten!D16&\" \"&Daten!D17&\"mm\"","v":" mm"},null,null,"ISO Höhe","H",{"$f":"Daten!D18","v":300}]
[null,{"$f":"IF(Daten!H7=TRUE,\"Ohne Steckprofile (bauseits)\",IF(Daten!H8=TRUE,\"Flachsteckprofile\",\"Winkelsteckprofile\"))","v":"Flachsteckprofile"}]
[null,"Steckprofil Typ",{"$f":"IF(Daten!H7=TRUE,\"bauseits\",IF(Daten!H8=TRUE,\"FSP 40\",\"WSP 40\"))","v":"FSP 40"},null,null,"Luft Steckprofil","LSP",{"$f":"Daten!H10","v":10}]
[{"$f":"IF(SUM(E30:E38)=0,0,1)","v":0},"Montagematerial"]
[{"$f":"E30","v":0},"Dichtungsband lose",null,null,{"$f":"Daten!J2","v":0},"Rollen à 10m"]
[{"$f":"E31","v":0},"Montagekleber Feba-Flex MS 290ml",null,null,{"$f":"Daten!J4","v":0},"Pack à 12 Kartuschen"]
[0,"Montagekleber Feba-Flex MS 600ml",null,null,{"$f":"Daten!J6","v":0},"Pack à 20 Beutel"]
[0,"Montagekleber Feba-PU 310ml",null,null,{"$f":"Daten!J8","v":0},"Pack à 12 Kartuschen"]
[0,"Rahmenschrauben 7.5 x 50mm",null,null,{"$f":"Daten!J9","v":0},"Pack à 100 Stück"]
[0,"Rahmenschrauben 7.5 x 70mm",null,null,{"$f":"Daten!J11","v":0},"Pack à 100 Stück"]
[0,"Rahmenschrauben 7.5 x 110mm",null,null,{"$f":"Daten!J13","v":0},"Pack à 100 Stück"]
[0,"Selbstbohrschrauben 4.2 x 19mm",null,null,{"$f":"Daten!J15","v":0},"Pack à 500 Stück"]
[0,"Selbstbohrschrauben 4.2 x 38mm",null,null,{"$f":"Daten!J17","v":0},"Pack à 200 Stück"]
[{"$f":"A40","v":0},"Bemerkung"]
[{"$f":"IF(B40=0,0,1)","v":0},{"$f":"Daten!L7","v":0}]

{"sheet":"Eingabeliste","index":1,"n_rows":106,"n_cols":44,"rows_kept":106,"cut":false,"hidden":false,"merged":[[2,27,2,35],[2,36,2,38],[4,3,4,4],[1,15,1,17],[2,15,2,21],[2,22,2,26],[2,5,2,8],[2,11,2,13],[2,3,2,4]]}
[1,1,{"$f":"IF(Daten!D1=\"Teilweise\",1,0)","v":0},1,1,{"$f":"IF(Daten!B8=FALSE,0,1)","v":0},{"$f":"F1","v":0},{"$f":"IF(Daten!B9=FALSE,0,1)","v":0},{"$f":"H1","v":0},1,1,1,{"$f":"IF(Daten!B7=TRUE,0,1)","v":0},{"$f":"M1","v":0},1,{"$f":"IF(Daten!B$4=TRUE,0,1)","v":0},0,0,0,{"$f":"IF(Daten!D$11=TRUE,1,0)","v":0},{"$f":"T1","v":0},{"$f":"U1","v":0},{"$f":"IF(AND(Daten!D1=\"Keine\",Daten!B7=TRUE),0,1)","v":0},{"$f":"IF(Daten!D1=\"Keine\",0,1)","v":0},{"$f":"IF(Daten!D1=\"Keine\",0,1)","v":0},0,0,{"$f":"IF(Daten!F1=\"Keine\",0,1)","v":0},0,{"$f":"AB1","v":0},{"$f":"IF(Daten!F7=TRUE,1,0)","v":0},{"$f":"IF(Daten!F$11=TRUE,0,1)","v":0},{"$f":"IF(Daten!F$11=TRUE,0,1)","v":0},{"$f":"IF(Daten!F$11=TRUE,0,1)","v":0},{"$f":"IF(Daten!F$11=TRUE,0,1)","v":0},{"$f":"IF(Daten!F$11=TRUE,0,1)","v":0},{"$f":"IF(Daten!D1=\"Keine\",0,1)","v":0},{"$f":"AK1","v":0},{"$f":"IF(Daten!D$8=\"Rahmendämmung\",1,0)","v":0},0,0,null,0,0]
[1]
[1,{"$f":"SUM(B6:B106)","v":0},null,null,null,"Ausmass Breite/Höhe",null,null,null,null,null,{"$f":"IF(M1=0,\"\",\"Ausmass Tiefe\")","v":""},null,null,null,"Leibungen",null,null,null,null,null,null,"Sturzblech",null,null,null,null,"Fensterbank",null,null,null,null,null,null,null,null,{"$f":"IF(Daten!D8=\"Ohne\",\"\",Daten!D8)","v":0}]
["Position","Anzahl ","Storenöffnung","Zargentyp","Zeichnung","Rahmenlicht horizontal","Rahmenlicht vertikal","Futterlicht-breite","Futterlicht-höhe","Zargenlicht horizontal","Zargenlicht vertikal","Mass bis Anschlag","Stärke Aufbau ab Anschlag","Überstand über Fassade","Zargentiefe","Spiegelbreite","Breite Rinne","Tiefe Rinne","Höhe Leibung","Breite Storenführung","Tiefe Storenführung","Achsabstand zu Anschlag","Tiefe bis Anschlag","Tiefe Storenkasten","Abstand Sturz","Höhe Sturz vorne","Höhe Sturz hinten","Fensterbank","Geschlossen?","Tiefe Fensterbank","Tiefe Streifbank","Abbordung vorne","Aufbordung hinten","Gefälle","Überstand ","Versatz zu Anschlag","Tiefe RD/SW","Höhe RD/SW","Höhe RD/SW","ISO Material","Höhe ISO","Steckprofile","Luft Steckprofil","Geschweisst"]
["[-]","[Stk]","[-]","[-]",null,"[mm]","[mm]","[mm]","[mm]","ZLh [mm]","ZLv [mm]","C [mm]","HL [mm]","Uz [mm]","ZT [mm]","SB [mm]","BF [mm]","ET [mm]","LH [mm]","X [mm]","Y [mm]","CS [mm]","ST [mm]","SL [mm]","AS [mm]","HS2 [mm]","HS1 [mm]","[-]","[0/1]","A [mm]","As [mm]","Va [mm]","Ha [mm]","α [mm]","Ue [mm]","VFB [mm]","RT [mm]","RV [mm]","RH [mm]","[-]","H [mm]","[-]","LSP [mm]","[0/1]"]
[null,null,{"$f":"IF(A6=\"\",\"\",IF(Daten!D$1<>\"Keine\",\"Ja\",\"Nein\"))","v":""},{"$f":"IF(A6=\"\",\"\",IF(Daten!B$4=TRUE,\"QB\",\"BS\")&IF(AR6=1,\"G\",\"\")&IF(C6=\"Nein\",\"-V\",IF(Daten!D$11=TRUE,\"-S\",\"-H\"))&IF(Daten!B$1=TRUE,\"-E\",\"\")&IF(Daten!F$9=TRUE,\"-B\",\"\")&IF(Daten!F$8=TRUE,\"A\",\"\"))","v":""},{"$f":"IF(A6=\"\",\"\",IFERROR(VLOOKUP(D6,Daten!D$43:G$94,2,FALSE),\"spez.\"))","v":""},null,null,null,null,{"$f":"IF(F6<>\"\",F6+(2*(Daten!B$13+2)),IF(H6<>\"\",H6-10,\"\"))","v":""},{"$f":"IFERROR(IF(G6<>\"\",G6+Daten!B$14+Daten!B$15+2+IF(AG6=\"-\",0,AG6),IF(I6<>\"\",I6-5,\"\")),\"\")","v":""},{"$f":"IF(B6=0,\"\",IF(L$1=0,0,Daten!B$10))","v":""},{"$f":"IF(B6=0,\"\",IF(M$1=0,0,Daten!B$11))","v":""},{"$f":"IF(B6=0,\"\",IF(N$1=0,0,Daten!B$12))","v":""},{"$f":"IFERROR(IF(OR(A6=\"\",B6=0),\"\",IF(M$1=1,L6+M6+N6,\"\")),\"\")","v":""},{"$f":"IF(B6=0,\"\",Daten!B$6)","v":""},{"$f":"IF(B6=0,\"\",Daten!B$16)","v":""},{"$f":"IF(B6=0,\"\",IF(Daten!B$1=TRUE,Daten!B$17,\"-\"))","v":""},{"$f":"IF(B6=0,\"\",IF(C6=\"Nein\",\"-\",Daten!D$7))","v":""},{"$f":"IF(B6=\"\",\"\",IF(C6=\"Nein\",\"-\",IF(T$1=0,\"\",Daten!D$12)))","v":""},{"$f":"IF(B6=\"\",\"\",IF(C6=\"Nein\",\"-\",IF(T$1=0,\"\",Daten!D$13)))","v":""},{"$f":"IF(B6=\"\",\"\",IF(C6=\"Nein\",\"-\",IF(T$1=0,\"\",IF(AK6=\"\",\"\",AK6+X6-Daten!D$20))))","v":""},{"$f":"IF(B6=0,\"\",IF(L$1=1,M6+N6,Daten!D$2))","v":""},{"$f":"IF(B6=0,\"\",IF(C6=\"Nein\",\"-\",Daten!D$6))","v":""},{"$f":"IF(B6=0,\"\",IF(C6=\"Nein\",\"-\",Daten!D$3))","v":""},{"$f":"IF(B6=0,\"\",Daten!D$4)","v":""},{"$f":"IF(B6=0,\"\",IF(C6=\"Nein\",\"-\",Daten!D$5))","v":""},{"$f":"IF(B6=0,\"\",IF(Daten!F$1=\"Keine\",Daten!A$45,IF(Daten!F$7=TRUE,Daten!A$48,Daten!A$44)))","v":""},{"$f":"IF(B6=0,\"\",IF(AB6=\"Standard\",IF(Daten!F$9=TRUE,1,0),0))","v":""},{"$f":"IFERROR(O6+AI6+AJ6,\"\")","v":""},{"$f":"IF(B6=0,\"\",IF(OR(AB6=Daten!A$46,AB6=Daten!A$47,AB6=Daten!A$48),AI6+W6,\"-\"))","v":""},{"$f":"IF(B6=0,\"\",IF(AB6=Daten!A$45,\"-\",Daten!F$5))","v":""},{"$f":"IF(B6=0,\"\",IF(AB6=Daten!A$45,\"-\",Daten!F$4))","v":""},{"$f":"IF(B6=0,\"\",IF(AB6=Daten!A$45,\"-\",Daten!F$6))","v":""},{"$f":"IF(B6=0,\"\",IF(AB6=Daten!A$45,\"-\",Daten!F$2))","v":""},{"$f":"IF(B6=0,\"\",IF(AB6=Daten!A$45,\"-\",Daten!F$3))","v":""},{"$f":"IF(B6=0,\"\",IFERROR(IF(C6=\"Nein\",\"-\",O6-X6-Y6-W6),\"\"))","v":""},{"$f":"IF(B6=0,\"\",IF(OR(C6=\"Nein\",Daten!D8=\"Ohne\"),\"-\",Daten!D$9))","v":""},{"$f":"IF(B6=0,\"\",IF(OR(C6=\"Nein\",Daten!D8=\"Ohne\"),\"-\",IF(Daten!D$8=\"Rahmendämmung\",Daten!D$10,\"-\")))","v":""},{"$f":"IF(B6=0,\"\",IF(AND(C6=\"Ja\",Daten!D$15=TRUE),Daten!D$16,\"-\"))","v":""},{"$f":"IF(AN6=\"\",\"\",IF(AND(C6=\"Ja\",Daten!D$15=TRUE),Daten!D$18,\"-\"))","v":""},{"$f":"IF(B6=0,\"\",IF(Daten!H$7=TRUE,\"bauseits\",IF(Daten!H$8=TRUE,\"FSP 40\",\"WSP 40\")))","v":""},{"$f":"IF(B6=0,\"\",Daten!H$10)","v":""},{"$f":"IFERROR(IF(B6=0,\"\",IF(Daten!H$2=TRUE,1,0)*IF(J6+P6+P6+Q6+Q6>Daten!B$62,0,1)*IF(K6+P6+Z6+AF6+10>Daten!B$62,0,1)),0)","v":""}]
[null,null,{"$f":"IF(A7=\"\",\"\",IF(Daten!D$1<>\"Keine\",\"Ja\",\"Nein\"))","v":""},{"$f":"IF(A7=\"\",\"\",IF(Daten!B$4=TRUE,\"QB\",\"BS\")&IF(AR7=1,\"G\",\"\")&IF(C7=\"Nein\",\"-V\",IF(Daten!D$11=TRUE,\"-S\",\"-H\"))&IF(Daten!B$1=TRUE,\"-E\",\"\")&IF(Daten!F$9=TRUE,\"-B\",\"\")&IF(Daten!F$8=TRUE,\"A\",\"\"))","v":""},{"$f":"IF(A7=\"\",\"\",IFERROR(VLOOKUP(D7,Daten!D$43:G$94,2,FALSE),\"spez.\"))","v":""},null,null,null,null,{"$f":"IF(F7<>\"\",F7+(2*(Daten!B$13+2)),IF(H7<>\"\",H7-10,\"\"))","v":""},{"$f":"IFERROR(IF(G7<>\"\",G7+Daten!B$14+Daten!B$15+2+IF(AG7=\"-\",0,AG7),IF(I7<>\"\",I7-5,\"\")),\"\")","v":""},{"$f":"IF(B7=0,\"\",IF(L$1=0,0,Daten!B$10))","v":""},{"$f":"IF(B7=0,\"\",IF(M$1=0,0,Daten!B$11))","v":""},{"$f":"IF(B7=0,\"\",IF(N$1=0,0,Daten!B$12))","v":""},{"$f":"IFERROR(IF(OR(A7=\"\",B7=0),\"\",IF(M$1=1,L7+M7+N7,\"\")),\"\")","v":""},{"$f":"IF(B7=0,\"\",Daten!B$6)","v":""},{"$f":"IF(B7=0,\"\",Daten!B$16)","v":""},{"$f":"IF(B7=0,\"\",IF(Daten!B$1=TRUE,Daten!B$17,\"-\"))","v":""},{"$f":"IF(B7=0,\"\",IF(C7=\"Nein\",\"-\",Daten!D$7))","v":""},{"$f":"IF(B7=\"\",\"\",IF(C7=\"Nein\",\"-\",IF(T$1=0,\"\",Daten!D$12)))","v":""},{"$f":"IF(B7=\"\",\"\",IF(C7=\"Nein\",\"-\",IF(T$1=0,\"\",Daten!D$13)))","v":""},{"$f":"IF(B7=\"\",\"\",IF(C7=\"Nein\",\"-\",IF(T$1=0,\"\",IF(AK7=\"\",\"\",AK7+X7-Daten!D$20))))","v":""},{"$f":"IF(B7=0,\"\",IF(L$1=1,M7+N7,Daten!D$2))","v":""},{"$f":"IF(B7=0,\"\",IF(C7=\"Nein\",\"-\",Daten!D$6))","v":""},{"$f":"IF(B7=0,\"\",IF(C7=\"Nein\",\"-\",Daten!D$3))","v":""},{"$f":"IF(B7=0,\"\",Daten!D$4)","v":""},{"$f":"IF(B7=0,\"\",IF(C7=\"Nein\",\"-\",Daten!D$5))","v":""},{"$f":"IF(B7=0,\"\",IF(Daten!F$1=\"Keine\",Daten!A$45,IF(Daten!F$7=TRUE,Daten!A$48,Daten!A$44)))","v":""},{"$f":"IF(B7=0,\"\",IF(AB7=\"Standard\",IF(Daten!F$9=TRUE,1,0),0))","v":""},{"$f":"IFERROR(O7+AI7+AJ7,\"\")","v":""},{"$f":"IF(B7=0,\"\",IF(OR(AB7=Daten!A$46,AB7=Daten!A$47,AB7=Daten!A$48),AI7+W7,\"-\"))","v":""},{"$f":"IF(B7=0,\"\",IF(AB7=Daten!A$45,\"-\",Daten!F$5))","v":""},{"$f":"IF(B7=0,\"\",IF(AB7=Daten!A$45,\"-\",Daten!F$4))","v":""},{"$f":"IF(B7=0,\"\",IF(AB7=Daten!A$45,\"-\",Daten!F$6))","v":""},{"$f":"IF(B7=0,\"\",IF(AB7=Daten!A$45,\"-\",Daten!F$2))","v":""},{"$f":"IF(B7=0,\"\",IF(AB7=Daten!A$45,\"-\",Daten!F$3))","v":""},"",{"$f":"IF(B7=0,\"\",IF(OR(C7=\"Nein\",Daten!D9=\"Ohne\"),\"-\",Daten!D$9))","v":""},{"$f":"IF(B7=0,\"\",IF(OR(C7=\"Nein\",Daten!D9=\"Ohne\"),\"-\",IF(Daten!D$8=\"Rahmendämmung\",Daten!D$10,\"-\")))","v":""},{"$f":"IF(B7=0,\"\",IF(AND(C7=\"Ja\",Daten!D$15=TRUE),Daten!D$16,\"-\"))","v":""},{"$f":"IF(AN7=\"\",\"\",IF(AND(C7=\"Ja\",Daten!D$15=TRUE),Daten!D$18,\"-\"))","v":""},{"$f":"IF(B7=0,\"\",IF(Daten!H$7=TRUE,\"bauseits\",IF(Daten!H$8=TRUE,\"FSP 40\",\"WSP 40\")))","v":""},{"$f":"IF(B7=0,\"\",Daten!H$10)","v":""},{"$f":"IFERROR(IF(B7=0,\"\",IF(Daten!H$2=TRUE,1,0)*IF(J7+P7+P7+Q7+Q7>Daten!B$62,0,1)*IF(K7+P7+Z7+AF7+10>Daten!B$62,0,1)),0)","v":""}]
[null,null,{"$f":"IF(A8=\"\",\"\",IF(Daten!D$1<>\"Keine\",\"Ja\",\"Nein\"))","v":""},{"$f":"IF(A8=\"\",\"\",IF(Daten!B$4=TRUE,\"QB\",\"BS\")&IF(AR8=1,\"G\",\"\")&IF(C8=\"Nein\",\"-V\",IF(Daten!D$11=TRUE,\"-S\",\"-H\"))&IF(Daten!B$1=TRUE,\"-E\",\"\")&IF(Daten!F$9=TRUE,\"-B\",\"\")&IF(Daten!F$8=TRUE,\"A\",\"\"))","v":""},{"$f":"IF(A8=\"\",\"\",IFERROR(VLOOKUP(D8,Daten!D$43:G$94,2,FALSE),\"spez.\"))","v":""},null,null,null,null,{"$f":"IF(F8<>\"\",F8+(2*(Daten!B$13+2)),IF(H8<>\"\",H8-10,\"\"))","v":""},{"$f":"IFERROR(IF(G8<>\"\",G8+Daten!B$14+Daten!B$15+2+IF(AG8=\"-\",0,AG8),IF(I8<>\"\",I8-5,\"\")),\"\")","v":""},{"$f":"IF(B8=0,\"\",IF(L$1=0,0,Daten!B$10))","v":""},{"$f":"IF(B8=0,\"\",IF(M$1=0,0,Daten!B$11))","v":""},{"$f":"IF(B8=0,\"\",IF(N$1=0,0,Daten!B$12))","v":""},"",{"$f":"IF(B8=0,\"\",Daten!B$6)","v":""},{"$f":"IF(B8=0,\"\",Daten!B$16)","v":""},{"$f":"IF(B8=0,\"\",IF(Daten!B$1=TRUE,Daten!B$17,\"-\"))","v":""},{"$f":"IF(B8=0,\"\",IF(C8=\"Nein\",\"-\",Daten!D$7))","v":""},{"$f":"IF(B8=\"\",\"\",IF(C8=\"Nein\",\"-\",IF(T$1=0,\"\",Daten!D$12)))","v":""},{"$f":"IF(B8=\"\",\"\",IF(C8=\"Nein\",\"-\",IF(T$1=0,\"\",Daten!D$13)))","v":""},{"$f":"IF(B8=\"\",\"\",IF(C8=\"Nein\",\"-\",IF(T$1=0,\"\",IF(AK8=\"\",\"\",AK8+X8-Daten!D$20))))","v":""},{"$f":"IF(B8=0,\"\",IF(L$1=1,M8+N8,Daten!D$2))","v":""},{"$f":"IF(B8=0,\"\",IF(C8=\"Nein\",\"-\",Daten!D$6))","v":""},{"$f":"IF(B8=0,\"\",IF(C8=\"Nein\",\"-\",Daten!D$3))","v":""},{"$f":"IF(B8=0,\"\",Daten!D$4)","v":""},{"$f":"IF(B8=0,\"\",IF(C8=\"Nein\",\"-\",Daten!D$5))","v":""},{"$f":"IF(B8=0,\"\",IF(Daten!F$1=\"Keine\",Daten!A$45,IF(Daten!F$7=TRUE,Daten!A$48,Daten!A$44)))","v":""},{"$f":"IF(B8=0,\"\",IF(AB8=\"Standard\",IF(Daten!F$9=TRUE,1,0),0))","v":""},"",{"$f":"IF(B8=0,\"\",IF(OR(AB8=Daten!A$46,AB8=Daten!A$47,AB8=Daten!A$48),AI8+W8,\"-\"))","v":""},{"$f":"IF(B8=0,\"\",IF(AB8=Daten!A$45,\"-\",Daten!F$5))","v":""},{"$f":"IF(B8=0,\"\",IF(AB8=Daten!A$45,\"-\",Daten!F$4))","v":""},{"$f":"IF(B8=0,\"\",IF(AB8=Daten!A$45,\"-\",Daten!F$6))","v":""},{"$f":"IF(B8=0,\"\",IF(AB8=Daten!A$45,\"-\",Daten!F$2))","v":""},{"$f":"IF(B8=0,\"\",IF(AB8=Daten!A$45,\"-\",Daten!F$3))","v":""},"",{"$f":"IF(B8=0,\"\",IF(OR(C8=\"Nein\",Daten!D10=\"Ohne\"),\"-\",Daten!D$9))","v":""},{"$f":"IF(B8=0,\"\",IF(OR(C8=\"Nein\",Daten!D10=\"Ohne\"),\"-\",IF(Daten!D$8=\"Rahmendämmung\",Daten!D$10,\"-\")))","v":""},{"$f":"IF(B8=0,\"\",IF(AND(C8=\"Ja\",Daten!D$15=TRUE),Daten!D$16,\"-\"))","v":""},{"$f":"IF(AN8=\"\",\"\",IF(AND(C8=\"Ja\",Daten!D$15=TRUE),Daten!D$18,\"-\"))","v":""},{"$f":"IF(B8=0,\"\",IF(Daten!H$7=TRUE,\"bauseits\",IF(Daten!H$8=TRUE,\"FSP 40\",\"WSP 40\")))","v":""},{"$f":"IF(B8=0,\"\",Daten!H$10)","v":""},{"$f":"IFERROR(IF(B8=0,\"\",IF(Daten!H$2=TRUE,1,0)*IF(J8+P8+P8+Q8+Q8>Daten!B$62,0,1)*IF(K8+P8+Z8+AF8+10>Daten!B$62,0,1)),0)","v":""}]
[null,null,{"$f":"IF(A9=\"\",\"\",IF(Daten!D$1<>\"Keine\",\"Ja\",\"Nein\"))","v":""},{"$f":"IF(A9=\"\",\"\",IF(Daten!B$4=TRUE,\"QB\",\"BS\")&IF(AR9=1,\"G\",\"\")&IF(C9=\"Nein\",\"-V\",IF(Daten!D$11=TRUE,\"-S\",\"-H\"))&IF(Daten!B$1=TRUE,\"-E\",\"\")&IF(Daten!F$9=TRUE,\"-B\",\"\")&IF(Daten!F$8=TRUE,\"A\",\"\"))","v":""},{"$f":"IF(A9=\"\",\"\",IFERROR(VLOOKUP(D9,Daten!D$43:G$94,2,FALSE),\"spez.\"))","v":""},null,null,null,null,{"$f":"IF(F9<>\"\",F9+(2*(Daten!B$13+2)),IF(H9<>\"\",H9-10,\"\"))","v":""},{"$f":"IFERROR(IF(G9<>\"\",G9+Daten!B$14+Daten!B$15+2+IF(AG9=\"-\",0,AG9),IF(I9<>\"\",I9-5,\"\")),\"\")","v":""},{"$f":"IF(B9=0,\"\",IF(L$1=0,0,Daten!B$10))","v":""},{"$f":"IF(B9=0,\"\",IF(M$1=0,0,Daten!B$11))","v":""},{"$f":"IF(B9=0,\"\",IF(N$1=0,0,Daten!B$12))","v":""},"",{"$f":"IF(B9=0,\"\",Daten!B$6)","v":""},{"$f":"IF(B9=0,\"\",Daten!B$16)","v":""},{"$f":"IF(B9=0,\"\",IF(Daten!B$1=TRUE,Daten!B$17,\"-\"))","v":""},{"$f":"IF(B9=0,\"\",IF(C9=\"Nein\",\"-\",Daten!D$7))","v":""},{"$f":"IF(B9=\"\",\"\",IF(C9=\"Nein\",\"-\",IF(T$1=0,\"\",Daten!D$12)))","v":""},{"$f":"IF(B9=\"\",\"\",IF(C9=\"Nein\",\"-\",IF(T$1=0,\"\",Daten!D$13)))","v":""},{"$f":"IF(B9=\"\",\"\",IF(C9=\"Nein\",\"-\",IF(T$1=0,\"\",IF(AK9=\"\",\"\",AK9+X9-Daten!D$20))))","v":""},{"$f":"IF(B9=0,\"\",IF(L$1=1,M9+N9,Daten!D$2))","v":""},{"$f":"IF(B9=0,\"\",IF(C9=\"Nein\",\"-\",Daten!D$6))","v":""},{"$f":"IF(B9=0,\"\",IF(C9=\"Nein\",\"-\",Daten!D$3))","v":""},{"$f":"IF(B9=0,\"\",Daten!D$4)","v":""},{"$f":"IF(B9=0,\"\",IF(C9=\"Nein\",\"-\",Daten!D$5))","v":""},{"$f":"IF(B9=0,\"\",IF(Daten!F$1=\"Keine\",Daten!A$45,IF(Daten!F$7=TRUE,Daten!A$48,Daten!A$44)))","v":""},{"$f":"IF(B9=0,\"\",IF(AB9=\"Standard\",IF(Daten!F$9=TRUE,1,0),0))","v":""},"",{"$f":"IF(B9=0,\"\",IF(OR(AB9=Daten!A$46,AB9=Daten!A$47,AB9=Daten!A$48),AI9+W9,\"-\"))","v":""},{"$f":"IF(B9=0,\"\",IF(AB9=Daten!A$45,\"-\",Daten!F$5))","v":""},{"$f":"IF(B9=0,\"\",IF(AB9=Daten!A$45,\"-\",Daten!F$4))","v":""},{"$f":"IF(B9=0,\"\",IF(AB9=Daten!A$45,\"-\",Daten!F$6))","v":""},{"$f":"IF(B9=0,\"\",IF(AB9=Daten!A$45,\"-\",Daten!F$2))","v":""},{"$f":"IF(B9=0,\"\",IF(AB9=Daten!A$45,\"-\",Daten!F$3))","v":""},"",{"$f":"IF(B9=0,\"\",IF(OR(C9=\"Nein\",Daten!D11=\"Ohne\"),\"-\",Daten!D$9))","v":""},{"$f":"IF(B9=0,\"\",IF(OR(C9=\"Nein\",Daten!D11=\"Ohne\"),\"-\",IF(Daten!D$8=\"Rahmendämmung\",Daten!D$10,\"-\")))","v":""},{"$f":"IF(B9=0,\"\",IF(AND(C9=\"Ja\",Daten!D$15=TRUE),Daten!D$16,\"-\"))","v":""},{"$f":"IF(AN9=\"\",\"\",IF(AND(C9=\"Ja\",Daten!D$15=TRUE),Daten!D$18,\"-\"))","v":""},{"$f":"IF(B9=0,\"\",IF(Daten!H$7=TRUE,\"bauseits\",IF(Daten!H$8=TRUE,\"FSP 40\",\"WSP 40\")))","v":""},{"$f":"IF(B9=0,\"\",Daten!H$10)","v":""},{"$f":"IFERROR(IF(B9=0,\"\",IF(Daten!H$2=TRUE,1,0)*IF(J9+P9+P9+Q9+Q9>Daten!B$62,0,1)*IF(K9+P9+Z9+AF9+10>Daten!B$62,0,1)),0)","v":""}]
[null,null,{"$f":"IF(A10=\"\",\"\",IF(Daten!D$1<>\"Keine\",\"Ja\",\"Nein\"))","v":""},{"$f":"IF(A10=\"\",\"\",IF(Daten!B$4=TRUE,\"QB\",\"BS\")&IF(AR10=1,\"G\",\"\")&IF(C10=\"Nein\",\"-V\",IF(Daten!D$11=TRUE,\"-S\",\"-H\"))&IF(Daten!B$1=TRUE,\"-E\",\"\")&IF(Daten!F$9=TRUE,\"-B\",\"\")&IF(Daten!F$8=TRUE,\"A\",\"\"))","v":""},{"$f":"IF(A10=\"\",\"\",IFERROR(VLOOKUP(D10,Daten!D$43:G$94,2,FALSE),\"spez.\"))","v":""},null,null,null,null,{"$f":"IF(F10<>\"\",F10+(2*(Daten!B$13+2)),IF(H10<>\"\",H10-10,\"\"))","v":""},{"$f":"IFERROR(IF(G10<>\"\",G10+Daten!B$14+Daten!B$15+2+IF(AG10=\"-\",0,AG10),IF(I10<>\"\",I10-5,\"\")),\"\")","v":""},{"$f":"IF(B10=0,\"\",IF(L$1=0,0,Daten!B$10))","v":""},{"$f":"IF(B10=0,\"\",IF(M$1=0,0,Daten!B$11))","v":""},{"$f":"IF(B10=0,\"\",IF(N$1=0,0,Daten!B$12))","v":""},"",{"$f":"IF(B10=0,\"\",Daten!B$6)","v":""},{"$f":"IF(B10=0,\"\",Daten!B$16)","v":""},{"$f":"IF(B10=0,\"\",IF(Daten!B$1=TRUE,Daten!B$17,\"-\"))","v":""},{"$f":"IF(B10=0,\"\",IF(C10=\"Nein\",\"-\",Daten!D$7))","v":""},{"$f":"IF(B10=\"\",\"\",IF(C10=\"Nein\",\"-\",IF(T$1=0,\"\",Daten!D$12)))","v":""},{"$f":"IF(B10=\"\",\"\",IF(C10=\"Nein\",\"-\",IF(T$1=0,\"\",Daten!D$13)))","v":""},{"$f":"IF(B10=\"\",\"\",IF(C10=\"Nein\",\"-\",IF(T$1=0,\"\",IF(AK10=\"\",\"\",AK10+X10-Daten!D$20))))","v":""},{"$f":"IF(B10=0,\"\",IF(L$1=1,M10+N10,Daten!D$2))","v":""},{"$f":"IF(B10=0,\"\",IF(C10=\"Nein\",\"-\",Daten!D$6))","v":""},{"$f":"IF(B10=0,\"\",IF(C10=\"Nein\",\"-\",Daten!D$3))","v":""},{"$f":"IF(B10=0,\"\",Daten!D$4)","v":""},{"$f":"IF(B10=0,\"\",IF(C10=\"Nein\",\"-\",Daten!D$5))","v":""},{"$f":"IF(B10=0,\"\",IF(Daten!F$1=\"Keine\",Daten!A$45,IF(Daten!F$7=TRUE,Daten!A$48,Daten!A$44)))","v":""},{"$f":"IF(B10=0,\"\",IF(AB10=\"Standard\",IF(Daten!F$9=TRUE,1,0),0))","v":""},"",{"$f":"IF(B10=0,\"\",IF(OR(AB10=Daten!A$46,AB10=Daten!A$47,AB10=Daten!A$48),AI10+W10,\"-\"))","v":""},{"$f":"IF(B10=0,\"\",IF(AB10=Daten!A$45,\"-\",Daten!F$5))","v":""},{"$f":"IF(B10=0,\"\",IF(AB10=Daten!A$45,\"-\",Daten!F$4))","v":""},{"$f":"IF(B10=0,\"\",IF(AB10=Daten!A$45,\"-\",Daten!F$6))","v":""},{"$f":"IF(B10=0,\"\",IF(AB10=Daten!A$45,\"-\",Daten!F$2))","v":""},{"$f":"IF(B10=0,\"\",IF(AB10=Daten!A$45,\"-\",Daten!F$3))","v":""},"",{"$f":"IF(B10=0,\"\",IF(OR(C10=\"Nein\",Daten!D12=\"Ohne\"),\"-\",Daten!D$9))","v":""},{"$f":"IF(B10=0,\"\",IF(OR(C10=\"Nein\",Daten!D12=\"Ohne\"),\"-\",IF(Daten!D$8=\"Rahmendämmung\",Daten!D$10,\"-\")))","v":""},{"$f":"IF(B10=0,\"\",IF(AND(C10=\"Ja\",Daten!D$15=TRUE),Daten!D$16,\"-\"))","v":""},{"$f":"IF(AN10=\"\",\"\",IF(AND(C10=\"Ja\",Daten!D$15=TRUE),Daten!D$18,\"-\"))","v":""},{"$f":"IF(B10=0,\"\",IF(Daten!H$7=TRUE,\"bauseits\",IF(Daten!H$8=TRUE,\"FSP 40\",\"WSP 40\")))","v":""},{"$f":"IF(B10=0,\"\",Daten!H$10)","v":""},{"$f":"IFERROR(IF(B10=0,\"\",IF(Daten!H$2=TRUE,1,0)*IF(J10+P10+P10+Q10+Q10>Daten!B$62,0,1)*IF(K10+P10+Z10+AF10+10>Daten!B$62,0,1)),0)","v":""}]
[null,null,{"$f":"IF(A11=\"\",\"\",IF(Daten!D$1<>\"Keine\",\"Ja\",\"Nein\"))","v":""},{"$f":"IF(A11=\"\",\"\",IF(Daten!B$4=TRUE,\"QB\",\"BS\")&IF(AR11=1,\"G\",\"\")&IF(C11=\"Nein\",\"-V\",IF(Daten!D$11=TRUE,\"-S\",\"-H\"))&IF(Daten!B$1=TRUE,\"-E\",\"\")&IF(Daten!F$9=TRUE,\"-B\",\"\")&IF(Daten!F$8=TRUE,\"A\",\"\"))","v":""},{"$f":"IF(A11=\"\",\"\",IFERROR(VLOOKUP(D11,Daten!D$43:G$94,2,FALSE),\"spez.\"))","v":""},null,null,null,null,{"$f":"IF(F11<>\"\",F11+(2*(Daten!B$13+2)),IF(H11<>\"\",H11-10,\"\"))","v":""},{"$f":"IFERROR(IF(G11<>\"\",G11+Daten!B$14+Daten!B$15+2+IF(AG11=\"-\",0,AG11),IF(I11<>\"\",I11-5,\"\")),\"\")","v":""},{"$f":"IF(B11=0,\"\",IF(L$1=0,0,Daten!B$10))","v":""},{"$f":"IF(B11=0,\"\",IF(M$1=0,0,Daten!B$11))","v":""},{"$f":"IF(B11=0,\"\",IF(N$1=0,0,Daten!B$12))","v":""},"",{"$f":"IF(B11=0,\"\",Daten!B$6)","v":""},{"$f":"IF(B11=0,\"\",Daten!B$16)","v":""},{"$f":"IF(B11=0,\"\",IF(Daten!B$1=TRUE,Daten!B$17,\"-\"))","v":""},{"$f":"IF(B11=0,\"\",IF(C11=\"Nein\",\"-\",Daten!D$7))","v":""},{"$f":"IF(B11=\"\",\"\",IF(C11=\"Nein\",\"-\",IF(T$1=0,\"\",Daten!D$12)))","v":""},{"$f":"IF(B11=\"\",\"\",IF(C11=\"Nein\",\"-\",IF(T$1=0,\"\",Daten!D$13)))","v":""},{"$f":"IF(B11=\"\",\"\",IF(C11=\"Nein\",\"-\",IF(T$1=0,\"\",IF(AK11=\"\",\"\",AK11+X11-Daten!D$20))))","v":""},{"$f":"IF(B11=0,\"\",IF(L$1=1,M11+N11,Daten!D$2))","v":""},{"$f":"IF(B11=0,\"\",IF(C11=\"Nein\",\"-\",Daten!D$6))","v":""},{"$f":"IF(B11=0,\"\",IF(C11=\"Nein\",\"-\",Daten!D$3))","v":""},{"$f":"IF(B11=0,\"\",Daten!D$4)","v":""},{"$f":"IF(B11=0,\"\",IF(C11=\"Nein\",\"-\",Daten!D$5))","v":""},{"$f":"IF(B11=0,\"\",IF(Daten!F$1=\"Keine\",Daten!A$45,IF(Daten!F$7=TRUE,Daten!A$48,Daten!A$44)))","v":""},{"$f":"IF(B11=0,\"\",IF(AB11=\"Standard\",IF(Daten!F$9=TRUE,1,0),0))","v":""},"",{"$f":"IF(B11=0,\"\",IF(OR(AB11=Daten!A$46,AB11=Daten!A$47,AB11=Daten!A$48),AI11+W11,\"-\"))","v":""},{"$f":"IF(B11=0,\"\",IF(AB11=Daten!A$45,\"-\",Daten!F$5))","v":""},{"$f":"IF(B11=0,\"\",IF(AB11=Daten!A$45,\"-\",Daten!F$4))","v":""},{"$f":"IF(B11=0,\"\",IF(AB11=Daten!A$45,\"-\",Daten!F$6))","v":""},{"$f":"IF(B11=0,\"\",IF(AB11=Daten!A$45,\"-\",Daten!F$2))","v":""},{"$f":"IF(B11=0,\"\",IF(AB11=Daten!A$45,\"-\",Daten!F$3))","v":""},"",{"$f":"IF(B11=0,\"\",IF(OR(C11=\"Nein\",Daten!D13=\"Ohne\"),\"-\",Daten!D$9))","v":""},{"$f":"IF(B11=0,\"\",IF(OR(C11=\"Nein\",Daten!D13=\"Ohne\"),\"-\",IF(Daten!D$8=\"Rahmendämmung\",Daten!D$10,\"-\")))","v":""},{"$f":"IF(B11=0,\"\",IF(AND(C11=\"Ja\",Daten!D$15=TRUE),Daten!D$16,\"-\"))","v":""},{"$f":"IF(AN11=\"\",\"\",IF(AND(C11=\"Ja\",Daten!D$15=TRUE),Daten!D$18,\"-\"))","v":""},{"$f":"IF(B11=0,\"\",IF(Daten!H$7=TRUE,\"bauseits\",IF(Daten!H$8=TRUE,\"FSP 40\",\"WSP 40\")))","v":""},{"$f":"IF(B11=0,\"\",Daten!H$10)","v":""},{"$f":"IFERROR(IF(B11=0,\"\",IF(Daten!H$2=TRUE,1,0)*IF(J11+P11+P11+Q11+Q11>Daten!B$62,0,1)*IF(K11+P11+Z11+AF11+10>Daten!B$62,0,1)),0)","v":""}]
[null,null,{"$f":"IF(A12=\"\",\"\",IF(Daten!D$1<>\"Keine\",\"Ja\",\"Nein\"))","v":""},{"$f":"IF(A12=\"\",\"\",IF(Daten!B$4=TRUE,\"QB\",\"BS\")&IF(AR12=1,\"G\",\"\")&IF(C12=\"Nein\",\"-V\",IF(Daten!D$11=TRUE,\"-S\",\"-H\"))&IF(Daten!B$1=TRUE,\"-E\",\"\")&IF(Daten!F$9=TRUE,\"-B\",\"\")&IF(Daten!F$8=TRUE,\"A\",\"\"))","v":""},{"$f":"IF(A12=\"\",\"\",IFERROR(VLOOKUP(D12,Daten!D$43:G$94,2,FALSE),\"spez.\"))","v":""},null,null,null,null,{"$f":"IF(F12<>\"\",F12+(2*(Daten!B$13+2)),IF(H12<>\"\",H12-10,\"\"))","v":""},{"$f":"IFERROR(IF(G12<>\"\",G12+Daten!B$14+Daten!B$15+2+IF(AG12=\"-\",0,AG12),IF(I12<>\"\",I12-5,\"\")),\"\")","v":""},{"$f":"IF(B12=0,\"\",IF(L$1=0,0,Daten!B$10))","v":""},{"$f":"IF(B12=0,\"\",IF(M$1=0,0,Daten!B$11))","v":""},{"$f":"IF(B12=0,\"\",IF(N$1=0,0,Daten!B$12))","v":""},"",{"$f":"IF(B12=0,\"\",Daten!B$6)","v":""},{"$f":"IF(B12=0,\"\",Daten!B$16)","v":""},{"$f":"IF(B12=0,\"\",IF(Daten!B$1=TRUE,Daten!B$17,\"-\"))","v":""},{"$f":"IF(B12=0,\"\",IF(C12=\"Nein\",\"-\",Daten!D$7))","v":""},{"$f":"IF(B12=\"\",\"\",IF(C12=\"Nein\",\"-\",IF(T$1=0,\"\",Daten!D$12)))","v":""},{"$f":"IF(B12=\"\",\"\",IF(C12=\"Nein\",\"-\",IF(T$1=0,\"\",Daten!D$13)))","v":""},{"$f":"IF(B12=\"\",\"\",IF(C12=\"Nein\",\"-\",IF(T$1=0,\"\",IF(AK12=\"\",\"\",AK12+X12-Daten!D$20))))","v":""},{"$f":"IF(B12=0,\"\",IF(L$1=1,M12+N12,Daten!D$2))","v":""},{"$f":"IF(B12=0,\"\",IF(C12=\"Nein\",\"-\",Daten!D$6))","v":""},{"$f":"IF(B12=0,\"\",IF(C12=\"Nein\",\"-\",Daten!D$3))","v":""},{"$f":"IF(B12=0,\"\",Daten!D$4)","v":""},{"$f":"IF(B12=0,\"\",IF(C12=\"Nein\",\"-\",Daten!D$5))","v":""},{"$f":"IF(B12=0,\"\",IF(Daten!F$1=\"Keine\",Daten!A$45,IF(Daten!F$7=TRUE,Daten!A$48,Daten!A$44)))","v":""},{"$f":"IF(B12=0,\"\",IF(AB12=\"Standard\",IF(Daten!F$9=TRUE,1,0),0))","v":""},"",{"$f":"IF(B12=0,\"\",IF(OR(AB12=Daten!A$46,AB12=Daten!A$47,AB12=Daten!A$48),AI12+W12,\"-\"))","v":""},{"$f":"IF(B12=0,\"\",IF(AB12=Daten!A$45,\"-\",Daten!F$5))","v":""},{"$f":"IF(B12=0,\"\",IF(AB12=Daten!A$45,\"-\",Daten!F$4))","v":""},{"$f":"IF(B12=0,\"\",IF(AB12=Daten!A$45,\"-\",Daten!F$6))","v":""},{"$f":"IF(B12=0,\"\",IF(AB12=Daten!A$45,\"-\",Daten!F$2))","v":""},{"$f":"IF(B12=0,\"\",IF(AB12=Daten!A$45,\"-\",Daten!F$3))","v":""},"",{"$f":"IF(B12=0,\"\",IF(OR(C12=\"Nein\",Daten!D14=\"Ohne\"),\"-\",Daten!D$9))","v":""},{"$f":"IF(B12=0,\"\",IF(OR(C12=\"Nein\",Daten!D14=\"Ohne\"),\"-\",IF(Daten!D$8=\"Rahmendämmung\",Daten!D$10,\"-\")))","v":""},{"$f":"IF(B12=0,\"\",IF(AND(C12=\"Ja\",Daten!D$15=TRUE),Daten!D$16,\"-\"))","v":""},{"$f":"IF(AN12=\"\",\"\",IF(AND(C12=\"Ja\",Daten!D$15=TRUE),Daten!D$18,\"-\"))","v":""},{"$f":"IF(B12=0,\"\",IF(Daten!H$7=TRUE,\"bauseits\",IF(Daten!H$8=TRUE,\"FSP 40\",\"WSP 40\")))","v":""},{"$f":"IF(B12=0,\"\",Daten!H$10)","v":""},{"$f":"IFERROR(IF(B12=0,\"\",IF(Daten!H$2=TRUE,1,0)*IF(J12+P12+P12+Q12+Q12>Daten!B$62,0,1)*IF(K12+P12+Z12+AF12+10>Daten!B$62,0,1)),0)","v":""}]
[null,null,{"$f":"IF(A13=\"\",\"\",IF(Daten!D$1<>\"Keine\",\"Ja\",\"Nein\"))","v":""},{"$f":"IF(A13=\"\",\"\",IF(Daten!B$4=TRUE,\"QB\",\"BS\")&IF(AR13=1,\"G\",\"\")&IF(C13=\"Nein\",\"-V\",IF(Daten!D$11=TRUE,\"-S\",\"-H\"))&IF(Daten!B$1=TRUE,\"-E\",\"\")&IF(Daten!F$9=TRUE,\"-B\",\"\")&IF(Daten!F$8=TRUE,\"A\",\"\"))","v":""},{"$f":"IF(A13=\"\",\"\",IFERROR(VLOOKUP(D13,Daten!D$43:G$94,2,FALSE),\"spez.\"))","v":""},null,null,null,null,{"$f":"IF(F13<>\"\",F13+(2*(Daten!B$13+2)),IF(H13<>\"\",H13-10,\"\"))","v":""},{"$f":"IFERROR(IF(G13<>\"\",G13+Daten!B$14+Daten!B$15+2+IF(AG13=\"-\",0,AG13),IF(I13<>\"\",I13-5,\"\")),\"\")","v":""},{"$f":"IF(B13=0,\"\",IF(L$1=0,0,Daten!B$10))","v":""},{"$f":"IF(B13=0,\"\",IF(M$1=0,0,Daten!B$11))","v":""},{"$f":"IF(B13=0,\"\",IF(N$1=0,0,Daten!B$12))","v":""},"",{"$f":"IF(B13=0,\"\",Daten!B$6)","v":""},{"$f":"IF(B13=0,\"\",Daten!B$16)","v":""},{"$f":"IF(B13=0,\"\",IF(Daten!B$1=TRUE,Daten!B$17,\"-\"))","v":""},{"$f":"IF(B13=0,\"\",IF(C13=\"Nein\",\"-\",Daten!D$7))","v":""},{"$f":"IF(B13=\"\",\"\",IF(C13=\"Nein\",\"-\",IF(T$1=0,\"\",Daten!D$12)))","v":""},{"$f":"IF(B13=\"\",\"\",IF(C13=\"Nein\",\"-\",IF(T$1=0,\"\",Daten!D$13)))","v":""},{"$f":"IF(B13=\"\",\"\",IF(C13=\"Nein\",\"-\",IF(T$1=0,\"\",IF(AK13=\"\",\"\",AK13+X13-Daten!D$20))))","v":""},{"$f":"IF(B13=0,\"\",IF(L$1=1,M13+N13,Daten!D$2))","v":""},{"$f":"IF(B13=0,\"\",IF(C13=\"Nein\",\"-\",Daten!D$6))","v":""},{"$f":"IF(B13=0,\"\",IF(C13=\"Nein\",\"-\",Daten!D$3))","v":""},{"$f":"IF(B13=0,\"\",Daten!D$4)","v":""},{"$f":"IF(B13=0,\"\",IF(C13=\"Nein\",\"-\",Daten!D$5))","v":""},{"$f":"IF(B13=0,\"\",IF(Daten!F$1=\"Keine\",Daten!A$45,IF(Daten!F$7=TRUE,Daten!A$48,Daten!A$44)))","v":""},{"$f":"IF(B13=0,\"\",IF(AB13=\"Standard\",IF(Daten!F$9=TRUE,1,0),0))","v":""},"",{"$f":"IF(B13=0,\"\",IF(OR(AB13=Daten!A$46,AB13=Daten!A$47,AB13=Daten!A$48),AI13+W13,\"-\"))","v":""},{"$f":"IF(B13=0,\"\",IF(AB13=Daten!A$45,\"-\",Daten!F$5))","v":""},{"$f":"IF(B13=0,\"\",IF(AB13=Daten!A$45,\"-\",Daten!F$4))","v":""},{"$f":"IF(B13=0,\"\",IF(AB13=Daten!A$45,\"-\",Daten!F$6))","v":""},{"$f":"IF(B13=0,\"\",IF(AB13=Daten!A$45,\"-\",Daten!F$2))","v":""},{"$f":"IF(B13=0,\"\",IF(AB13=Daten!A$45,\"-\",Daten!F$3))","v":""},"",{"$f":"IF(B13=0,\"\",IF(OR(C13=\"Nein\",Daten!D15=\"Ohne\"),\"-\",Daten!D$9))","v":""},{"$f":"IF(B13=0,\"\",IF(OR(C13=\"Nein\",Daten!D15=\"Ohne\"),\"-\",IF(Daten!D$8=\"Rahmendämmung\",Daten!D$10,\"-\")))","v":""},{"$f":"IF(B13=0,\"\",IF(AND(C13=\"Ja\",Daten!D$15=TRUE),Daten!D$16,\"-\"))","v":""},{"$f":"IF(AN13=\"\",\"\",IF(AND(C13=\"Ja\",Daten!D$15=TRUE),Daten!D$18,\"-\"))","v":""},{"$f":"IF(B13=0,\"\",IF(Daten!H$7=TRUE,\"bauseits\",IF(Daten!H$8=TRUE,\"FSP 40\",\"WSP 40\")))","v":""},{"$f":"IF(B13=0,\"\",Daten!H$10)","v":""},{"$f":"IFERROR(IF(B13=0,\"\",IF(Daten!H$2=TRUE,1,0)*IF(J13+P13+P13+Q13+Q13>Daten!B$62,0,1)*IF(K13+P13+Z13+AF13+10>Daten!B$62,0,1)),0)","v":""}]
[null,null,{"$f":"IF(A14=\"\",\"\",IF(Daten!D$1<>\"Keine\",\"Ja\",\"Nein\"))","v":""},{"$f":"IF(A14=\"\",\"\",IF(Daten!B$4=TRUE,\"QB\",\"BS\")&IF(AR14=1,\"G\",\"\")&IF(C14=\"Nein\",\"-V\",IF(Daten!D$11=TRUE,\"-S\",\"-H\"))&IF(Daten!B$1=TRUE,\"-E\",\"\")&IF(Daten!F$9=TRUE,\"-B\",\"\")&IF(Daten!F$8=TRUE,\"A\",\"\"))","v":""},{"$f":"IF(A14=\"\",\"\",IFERROR(VLOOKUP(D14,Daten!D$43:G$94,2,FALSE),\"spez.\"))","v":""},null,null,null,null,{"$f":"IF(F14<>\"\",F14+(2*(Daten!B$13+2)),IF(H14<>\"\",H14-10,\"\"))","v":""},{"$f":"IFERROR(IF(G14<>\"\",G14+Daten!B$14+Daten!B$15+2+IF(AG14=\"-\",0,AG14),IF(I14<>\"\",I14-5,\"\")),\"\")","v":""},{"$f":"IF(B14=0,\"\",IF(L$1=0,0,Daten!B$10))","v":""},{"$f":"IF(B14=0,\"\",IF(M$1=0,0,Daten!B$11))","v":""},{"$f":"IF(B14=0,\"\",IF(N$1=0,0,Daten!B$12))","v":""},"",{"$f":"IF(B14=0,\"\",Daten!B$6)","v":""},{"$f":"IF(B14=0,\"\",Daten!B$16)","v":""},{"$f":"IF(B14=0,\"\",IF(Daten!B$1=TRUE,Daten!B$17,\"-\"))","v":""},{"$f":"IF(B14=0,\"\",IF(C14=\"Nein\",\"-\",Daten!D$7))","v":""},{"$f":"IF(B14=\"\",\"\",IF(C14=\"Nein\",\"-\",IF(T$1=0,\"\",Daten!D$12)))","v":""},{"$f":"IF(B14=\"\",\"\",IF(C14=\"Nein\",\"-\",IF(T$1=0,\"\",Daten!D$13)))","v":""},{"$f":"IF(B14=\"\",\"\",IF(C14=\"Nein\",\"-\",IF(T$1=0,\"\",IF(AK14=\"\",\"\",AK14+X14-Daten!D$20))))","v":""},{"$f":"IF(B14=0,\"\",IF(L$1=1,M14+N14,Daten!D$2))","v":""},{"$f":"IF(B14=0,\"\",IF(C14=\"Nein\",\"-\",Daten!D$6))","v":""},{"$f":"IF(B14=0,\"\",IF(C14=\"Nein\",\"-\",Daten!D$3))","v":""},{"$f":"IF(B14=0,\"\",Daten!D$4)","v":""},{"$f":"IF(B14=0,\"\",IF(C14=\"Nein\",\"-\",Daten!D$5))","v":""},{"$f":"IF(B14=0,\"\",IF(Daten!F$1=\"Keine\",Daten!A$45,IF(Daten!F$7=TRUE,Daten!A$48,Daten!A$44)))","v":""},{"$f":"IF(B14=0,\"\",IF(AB14=\"Standard\",IF(Daten!F$9=TRUE,1,0),0))","v":""},"",{"$f":"IF(B14=0,\"\",IF(OR(AB14=Daten!A$46,AB14=Daten!A$47,AB14=Daten!A$48),AI14+W14,\"-\"))","v":""},{"$f":"IF(B14=0,\"\",IF(AB14=Daten!A$45,\"-\",Daten!F$5))","v":""},{"$f":"IF(B14=0,\"\",IF(AB14=Daten!A$45,\"-\",Daten!F$4))","v":""},{"$f":"IF(B14=0,\"\",IF(AB14=Daten!A$45,\"-\",Daten!F$6))","v":""},{"$f":"IF(B14=0,\"\",IF(AB14=Daten!A$45,\"-\",Daten!F$2))","v":""},{"$f":"IF(B14=0,\"\",IF(AB14=Daten!A$45,\"-\",Daten!F$3))","v":""},"",{"$f":"IF(B14=0,\"\",IF(OR(C14=\"Nein\",Daten!D16=\"Ohne\"),\"-\",Daten!D$9))","v":""},{"$f":"IF(B14=0,\"\",IF(OR(C14=\"Nein\",Daten!D16=\"Ohne\"),\"-\",IF(Daten!D$8=\"Rahmendämmung\",Daten!D$10,\"-\")))","v":""},{"$f":"IF(B14=0,\"\",IF(AND(C14=\"Ja\",Daten!D$15=TRUE),Daten!D$16,\"-\"))","v":""},{"$f":"IF(AN14=\"\",\"\",IF(AND(C14=\"Ja\",Daten!D$15=TRUE),Daten!D$18,\"-\"))","v":""},{"$f":"IF(B14=0,\"\",IF(Daten!H$7=TRUE,\"bauseits\",IF(Daten!H$8=TRUE,\"FSP 40\",\"WSP 40\")))","v":""},{"$f":"IF(B14=0,\"\",Daten!H$10)","v":""},{"$f":"IFERROR(IF(B14=0,\"\",IF(Daten!H$2=TRUE,1,0)*IF(J14+P14+P14+Q14+Q14>Daten!B$62,0,1)*IF(K14+P14+Z14+AF14+10>Daten!B$62,0,1)),0)","v":""}]
[null,null,{"$f":"IF(A15=\"\",\"\",IF(Daten!D$1<>\"Keine\",\"Ja\",\"Nein\"))","v":""},{"$f":"IF(A15=\"\",\"\",IF(Daten!B$4=TRUE,\"QB\",\"BS\")&IF(AR15=1,\"G\",\"\")&IF(C15=\"Nein\",\"-V\",IF(Daten!D$11=TRUE,\"-S\",\"-H\"))&IF(Daten!B$1=TRUE,\"-E\",\"\")&IF(Daten!F$9=TRUE,\"-B\",\"\")&IF(Daten!F$8=TRUE,\"A\",\"\"))","v":""},{"$f":"IF(A15=\"\",\"\",IFERROR(VLOOKUP(D15,Daten!D$43:G$94,2,FALSE),\"spez.\"))","v":""},null,null,null,null,{"$f":"IF(F15<>\"\",F15+(2*(Daten!B$13+2)),IF(H15<>\"\",H15-10,\"\"))","v":""},{"$f":"IFERROR(IF(G15<>\"\",G15+Daten!B$14+Daten!B$15+2+IF(AG15=\"-\",0,AG15),IF(I15<>\"\",I15-5,\"\")),\"\")","v":""},{"$f":"IF(B15=0,\"\",IF(L$1=0,0,Daten!B$10))","v":""},{"$f":"IF(B15=0,\"\",IF(M$1=0,0,Daten!B$11))","v":""},{"$f":"IF(B15=0,\"\",IF(N$1=0,0,Daten!B$12))","v":""},"",{"$f":"IF(B15=0,\"\",Daten!B$6)","v":""},{"$f":"IF(B15=0,\"\",Daten!B$16)","v":""},{"$f":"IF(B15=0,\"\",IF(Daten!B$1=TRUE,Daten!B$17,\"-\"))","v":""},{"$f":"IF(B15=0,\"\",IF(C15=\"Nein\",\"-\",Daten!D$7))","v":""},{"$f":"IF(B15=\"\",\"\",IF(C15=\"Nein\",\"-\",IF(T$1=0,\"\",Daten!D$12)))","v":""},{"$f":"IF(B15=\"\",\"\",IF(C15=\"Nein\",\"-\",IF(T$1=0,\"\",Daten!D$13)))","v":""},{"$f":"IF(B15=\"\",\"\",IF(C15=\"Nein\",\"-\",IF(T$1=0,\"\",IF(AK15=\"\",\"\",AK15+X15-Daten!D$20))))","v":""},{"$f":"IF(B15=0,\"\",IF(L$1=1,M15+N15,Daten!D$2))","v":""},{"$f":"IF(B15=0,\"\",IF(C15=\"Nein\",\"-\",Daten!D$6))","v":""},{"$f":"IF(B15=0,\"\",IF(C15=\"Nein\",\"-\",Daten!D$3))","v":""},{"$f":"IF(B15=0,\"\",Daten!D$4)","v":""},{"$f":"IF(B15=0,\"\",IF(C15=\"Nein\",\"-\",Daten!D$5))","v":""},{"$f":"IF(B15=0,\"\",IF(Daten!F$1=\"Keine\",Daten!A$45,IF(Daten!F$7=TRUE,Daten!A$48,Daten!A$44)))","v":""},{"$f":"IF(B15=0,\"\",IF(AB15=\"Standard\",IF(Daten!F$9=TRUE,1,0),0))","v":""},"",{"$f":"IF(B15=0,\"\",IF(OR(AB15=Daten!A$46,AB15=Daten!A$47,AB15=Daten!A$48),AI15+W15,\"-\"))","v":""},{"$f":"IF(B15=0,\"\",IF(AB15=Daten!A$45,\"-\",Daten!F$5))","v":""},{"$f":"IF(B15=0,\"\",IF(AB15=Daten!A$45,\"-\",Daten!F$4))","v":""},{"$f":"IF(B15=0,\"\",IF(AB15=Daten!A$45,\"-\",Daten!F$6))","v":""},{"$f":"IF(B15=0,\"\",IF(AB15=Daten!A$45,\"-\",Daten!F$2))","v":""},{"$f":"IF(B15=0,\"\",IF(AB15=Daten!A$45,\"-\",Daten!F$3))","v":""},"",{"$f":"IF(B15=0,\"\",IF(OR(C15=\"Nein\",Daten!D17=\"Ohne\"),\"-\",Daten!D$9))","v":""},{"$f":"IF(B15=0,\"\",IF(OR(C15=\"Nein\",Daten!D17=\"Ohne\"),\"-\",IF(Daten!D$8=\"Rahmendämmung\",Daten!D$10,\"-\")))","v":""},{"$f":"IF(B15=0,\"\",IF(AND(C15=\"Ja\",Daten!D$15=TRUE),Daten!D$16,\"-\"))","v":""},{"$f":"IF(AN15=\"\",\"\",IF(AND(C15=\"Ja\",Daten!D$15=TRUE),Daten!D$18,\"-\"))","v":""},{"$f":"IF(B15=0,\"\",IF(Daten!H$7=TRUE,\"bauseits\",IF(Daten!H$8=TRUE,\"FSP 40\",\"WSP 40\")))","v":""},{"$f":"IF(B15=0,\"\",Daten!H$10)","v":""},{"$f":"IFERROR(IF(B15=0,\"\",IF(Daten!H$2=TRUE,1,0)*IF(J15+P15+P15+Q15+Q15>Daten!B$62,0,1)*IF(K15+P15+Z15+AF15+10>Daten!B$62,0,1)),0)","v":""}]
[null,null,{"$f":"IF(A16=\"\",\"\",IF(Daten!D$1<>\"Keine\",\"Ja\",\"Nein\"))","v":""},{"$f":"IF(A16=\"\",\"\",IF(Daten!B$4=TRUE,\"QB\",\"BS\")&IF(AR16=1,\"G\",\"\")&IF(C16=\"Nein\",\"-V\",IF(Daten!D$11=TRUE,\"-S\",\"-H\"))&IF(Daten!B$1=TRUE,\"-E\",\"\")&IF(Daten!F$9=TRUE,\"-B\",\"\")&IF(Daten!F$8=TRUE,\"A\",\"\"))","v":""},{"$f":"IF(A16=\"\",\"\",IFERROR(VLOOKUP(D16,Daten!D$43:G$94,2,FALSE),\"spez.\"))","v":""},null,null,null,null,{"$f":"IF(F16<>\"\",F16+(2*(Daten!B$13+2)),IF(H16<>\"\",H16-10,\"\"))","v":""},{"$f":"IFERROR(IF(G16<>\"\",G16+Daten!B$14+Daten!B$15+2+IF(AG16=\"-\",0,AG16),IF(I16<>\"\",I16-5,\"\")),\"\")","v":""},{"$f":"IF(B16=0,\"\",IF(L$1=0,0,Daten!B$10))","v":""},{"$f":"IF(B16=0,\"\",IF(M$1=0,0,Daten!B$11))","v":""},{"$f":"IF(B16=0,\"\",IF(N$1=0,0,Daten!B$12))","v":""},"",{"$f":"IF(B16=0,\"\",Daten!B$6)","v":""},{"$f":"IF(B16=0,\"\",Daten!B$16)","v":""},{"$f":"IF(B16=0,\"\",IF(Daten!B$1=TRUE,Daten!B$17,\"-\"))","v":""},{"$f":"IF(B16=0,\"\",IF(C16=\"Nein\",\"-\",Daten!D$7))","v":""},{"$f":"IF(B16=\"\",\"\",IF(C16=\"Nein\",\"-\",IF(T$1=0,\"\",Daten!D$12)))","v":""},{"$f":"IF(B16=\"\",\"\",IF(C16=\"Nein\",\"-\",IF(T$1=0,\"\",Daten!D$13)))","v":""},{"$f":"IF(B16=\"\",\"\",IF(C16=\"Nein\",\"-\",IF(T$1=0,\"\",IF(AK16=\"\",\"\",AK16+X16-Daten!D$20))))","v":""},{"$f":"IF(B16=0,\"\",IF(L$1=1,M16+N16,Daten!D$2))","v":""},{"$f":"IF(B16=0,\"\",IF(C16=\"Nein\",\"-\",Daten!D$6))","v":""},{"$f":"IF(B16=0,\"\",IF(C16=\"Nein\",\"-\",Daten!D$3))","v":""},{"$f":"IF(B16=0,\"\",Daten!D$4)","v":""},{"$f":"IF(B16=0,\"\",IF(C16=\"Nein\",\"-\",Daten!D$5))","v":""},{"$f":"IF(B16=0,\"\",IF(Daten!F$1=\"Keine\",Daten!A$45,IF(Daten!F$7=TRUE,Daten!A$48,Daten!A$44)))","v":""},{"$f":"IF(B16=0,\"\",IF(AB16=\"Standard\",IF(Daten!F$9=TRUE,1,0),0))","v":""},"",{"$f":"IF(B16=0,\"\",IF(OR(AB16=Daten!A$46,AB16=Daten!A$47,AB16=Daten!A$48),AI16+W16,\"-\"))","v":""},{"$f":"IF(B16=0,\"\",IF(AB16=Daten!A$45,\"-\",Daten!F$5))","v":""},{"$f":"IF(B16=0,\"\",IF(AB16=Daten!A$45,\"-\",Daten!F$4))","v":""},{"$f":"IF(B16=0,\"\",IF(AB16=Daten!A$45,\"-\",Daten!F$6))","v":""},{"$f":"IF(B16=0,\"\",IF(AB16=Daten!A$45,\"-\",Daten!F$2))","v":""},{"$f":"IF(B16=0,\"\",IF(AB16=Daten!A$45,\"-\",Daten!F$3))","v":""},"",{"$f":"IF(B16=0,\"\",IF(OR(C16=\"Nein\",Daten!D18=\"Ohne\"),\"-\",Daten!D$9))","v":""},{"$f":"IF(B16=0,\"\",IF(OR(C16=\"Nein\",Daten!D18=\"Ohne\"),\"-\",IF(Daten!D$8=\"Rahmendämmung\",Daten!D$10,\"-\")))","v":""},{"$f":"IF(B16=0,\"\",IF(AND(C16=\"Ja\",Daten!D$15=TRUE),Daten!D$16,\"-\"))","v":""},{"$f":"IF(AN16=\"\",\"\",IF(AND(C16=\"Ja\",Daten!D$15=TRUE),Daten!D$18,\"-\"))","v":""},{"$f":"IF(B16=0,\"\",IF(Daten!H$7=TRUE,\"bauseits\",IF(Daten!H$8=TRUE,\"FSP 40\",\"WSP 40\")))","v":""},{"$f":"IF(B16=0,\"\",Daten!H$10)","v":""},{"$f":"IFERROR(IF(B16=0,\"\",IF(Daten!H$2=TRUE,1,0)*IF(J16+P16+P16+Q16+Q16>Daten!B$62,0,1)*IF(K16+P16+Z16+AF16+10>Daten!B$62,0,1)),0)","v":""}]
[null,null,{"$f":"IF(A17=\"\",\"\",IF(Daten!D$1<>\"Keine\",\"Ja\",\"Nein\"))","v":""},{"$f":"IF(A17=\"\",\"\",IF(Daten!B$4=TRUE,\"QB\",\"BS\")&IF(AR17=1,\"G\",\"\")&IF(C17=\"Nein\",\"-V\",IF(Daten!D$11=TRUE,\"-S\",\"-H\"))&IF(Daten!B$1=TRUE,\"-E\",\"\")&IF(Daten!F$9=TRUE,\"-B\",\"\")&IF(Daten!F$8=TRUE,\"A\",\"\"))","v":""},{"$f":"IF(A17=\"\",\"\",IFERROR(VLOOKUP(D17,Daten!D$43:G$94,2,FALSE),\"spez.\"))","v":""},null,null,null,null,{"$f":"IF(F17<>\"\",F17+(2*(Daten!B$13+2)),IF(H17<>\"\",H17-10,\"\"))","v":""},{"$f":"IFERROR(IF(G17<>\"\",G17+Daten!B$14+Daten!B$15+2+IF(AG17=\"-\",0,AG17),IF(I17<>\"\",I17-5,\"\")),\"\")","v":""},{"$f":"IF(B17=0,\"\",IF(L$1=0,0,Daten!B$10))","v":""},{"$f":"IF(B17=0,\"\",IF(M$1=0,0,Daten!B$11))","v":""},{"$f":"IF(B17=0,\"\",IF(N$1=0,0,Daten!B$12))","v":""},"",{"$f":"IF(B17=0,\"\",Daten!B$6)","v":""},{"$f":"IF(B17=0,\"\",Daten!B$16)","v":""},{"$f":"IF(B17=0,\"\",IF(Daten!B$1=TRUE,Daten!B$17,\"-\"))","v":""},{"$f":"IF(B17=0,\"\",IF(C17=\"Nein\",\"-\",Daten!D$7))","v":""},{"$f":"IF(B17=\"\",\"\",IF(C17=\"Nein\",\"-\",IF(T$1=0,\"\",Daten!D$12)))","v":""},{"$f":"IF(B17=\"\",\"\",IF(C17=\"Nein\",\"-\",IF(T$1=0,\"\",Daten!D$13)))","v":""},{"$f":"IF(B17=\"\",\"\",IF(C17=\"Nein\",\"-\",IF(T$1=0,\"\",IF(AK17=\"\",\"\",AK17+X17-Daten!D$20))))","v":""},{"$f":"IF(B17=0,\"\",IF(L$1=1,M17+N17,Daten!D$2))","v":""},{"$f":"IF(B17=0,\"\",IF(C17=\"Nein\",\"-\",Daten!D$6))","v":""},{"$f":"IF(B17=0,\"\",IF(C17=\"Nein\",\"-\",Daten!D$3))","v":""},{"$f":"IF(B17=0,\"\",Daten!D$4)","v":""},{"$f":"IF(B17=0,\"\",IF(C17=\"Nein\",\"-\",Daten!D$5))","v":""},{"$f":"IF(B17=0,\"\",IF(Daten!F$1=\"Keine\",Daten!A$45,IF(Daten!F$7=TRUE,Daten!A$48,Daten!A$44)))","v":""},{"$f":"IF(B17=0,\"\",IF(AB17=\"Standard\",IF(Daten!F$9=TRUE,1,0),0))","v":""},"",{"$f":"IF(B17=0,\"\",IF(OR(AB17=Daten!A$46,AB17=Daten!A$47,AB17=Daten!A$48),AI17+W17,\"-\"))","v":""},{"$f":"IF(B17=0,\"\",IF(AB17=Daten!A$45,\"-\",Daten!F$5))","v":""},{"$f":"IF(B17=0,\"\",IF(AB17=Daten!A$45,\"-\",Daten!F$4))","v":""},{"$f":"IF(B17=0,\"\",IF(AB17=Daten!A$45,\"-\",Daten!F$6))","v":""},{"$f":"IF(B17=0,\"\",IF(AB17=Daten!A$45,\"-\",Daten!F$2))","v":""},{"$f":"IF(B17=0,\"\",IF(AB17=Daten!A$45,\"-\",Daten!F$3))","v":""},"",{"$f":"IF(B17=0,\"\",IF(OR(C17=\"Nein\",Daten!D19=\"Ohne\"),\"-\",Daten!D$9))","v":""},{"$f":"IF(B17=0,\"\",IF(OR(C17=\"Nein\",Daten!D19=\"Ohne\"),\"-\",IF(Daten!D$8=\"Rahmendämmung\",Daten!D$10,\"-\")))","v":""},{"$f":"IF(B17=0,\"\",IF(AND(C17=\"Ja\",Daten!D$15=TRUE),Daten!D$16,\"-\"))","v":""},{"$f":"IF(AN17=\"\",\"\",IF(AND(C17=\"Ja\",Daten!D$15=TRUE),Daten!D$18,\"-\"))","v":""},{"$f":"IF(B17=0,\"\",IF(Daten!H$7=TRUE,\"bauseits\",IF(Daten!H$8=TRUE,\"FSP 40\",\"WSP 40\")))","v":""},{"$f":"IF(B17=0,\"\",Daten!H$10)","v":""},{"$f":"IFERROR(IF(B17=0,\"\",IF(Daten!H$2=TRUE,1,0)*IF(J17+P17+P17+Q17+Q17>Daten!B$62,0,1)*IF(K17+P17+Z17+AF17+10>Daten!B$62,0,1)),0)","v":""}]
[null,null,{"$f":"IF(A18=\"\",\"\",IF(Daten!D$1<>\"Keine\",\"Ja\",\"Nein\"))","v":""},{"$f":"IF(A18=\"\",\"\",IF(Daten!B$4=TRUE,\"QB\",\"BS\")&IF(AR18=1,\"G\",\"\")&IF(C18=\"Nein\",\"-V\",IF(Daten!D$11=TRUE,\"-S\",\"-H\"))&IF(Daten!B$1=TRUE,\"-E\",\"\")&IF(Daten!F$9=TRUE,\"-B\",\"\")&IF(Daten!F$8=TRUE,\"A\",\"\"))","v":""},{"$f":"IF(A18=\"\",\"\",IFERROR(VLOOKUP(D18,Daten!D$43:G$94,2,FALSE),\"spez.\"))","v":""},null,null,null,null,{"$f":"IF(F18<>\"\",F18+(2*(Daten!B$13+2)),IF(H18<>\"\",H18-10,\"\"))","v":""},{"$f":"IFERROR(IF(G18<>\"\",G18+Daten!B$14+Daten!B$15+2+IF(AG18=\"-\",0,AG18),IF(I18<>\"\",I18-5,\"\")),\"\")","v":""},{"$f":"IF(B18=0,\"\",IF(L$1=0,0,Daten!B$10))","v":""},{"$f":"IF(B18=0,\"\",IF(M$1=0,0,Daten!B$11))","v":""},{"$f":"IF(B18=0,\"\",IF(N$1=0,0,Daten!B$12))","v":""},"",{"$f":"IF(B18=0,\"\",Daten!B$6)","v":""},{"$f":"IF(B18=0,\"\",Daten!B$16)","v":""},{"$f":"IF(B18=0,\"\",IF(Daten!B$1=TRUE,Daten!B$17,\"-\"))","v":""},{"$f":"IF(B18=0,\"\",IF(C18=\"Nein\",\"-\",Daten!D$7))","v":""},{"$f":"IF(B18=\"\",\"\",IF(C18=\"Nein\",\"-\",IF(T$1=0,\"\",Daten!D$12)))","v":""},{"$f":"IF(B18=\"\",\"\",IF(C18=\"Nein\",\"-\",IF(T$1=0,\"\",Daten!D$13)))","v":""},{"$f":"IF(B18=\"\",\"\",IF(C18=\"Nein\",\"-\",IF(T$1=0,\"\",IF(AK18=\"\",\"\",AK18+X18-Daten!D$20))))","v":""},{"$f":"IF(B18=0,\"\",IF(L$1=1,M18+N18,Daten!D$2))","v":""},{"$f":"IF(B18=0,\"\",IF(C18=\"Nein\",\"-\",Daten!D$6))","v":""},{"$f":"IF(B18=0,\"\",IF(C18=\"Nein\",\"-\",Daten!D$3))","v":""},{"$f":"IF(B18=0,\"\",Daten!D$4)","v":""},{"$f":"IF(B18=0,\"\",IF(C18=\"Nein\",\"-\",Daten!D$5))","v":""},{"$f":"IF(B18=0,\"\",IF(Daten!F$1=\"Keine\",Daten!A$45,IF(Daten!F$7=TRUE,Daten!A$48,Daten!A$44)))","v":""},{"$f":"IF(B18=0,\"\",IF(AB18=\"Standard\",IF(Daten!F$9=TRUE,1,0),0))","v":""},"",{"$f":"IF(B18=0,\"\",IF(OR(AB18=Daten!A$46,AB18=Daten!A$47,AB18=Daten!A$48),AI18+W18,\"-\"))","v":""},{"$f":"IF(B18=0,\"\",IF(AB18=Daten!A$45,\"-\",Daten!F$5))","v":""},{"$f":"IF(B18=0,\"\",IF(AB18=Daten!A$45,\"-\",Daten!F$4))","v":""},{"$f":"IF(B18=0,\"\",IF(AB18=Daten!A$45,\"-\",Daten!F$6))","v":""},{"$f":"IF(B18=0,\"\",IF(AB18=Daten!A$45,\"-\",Daten!F$2))","v":""},{"$f":"IF(B18=0,\"\",IF(AB18=Daten!A$45,\"-\",Daten!F$3))","v":""},"",{"$f":"IF(B18=0,\"\",IF(OR(C18=\"Nein\",Daten!D20=\"Ohne\"),\"-\",Daten!D$9))","v":""},{"$f":"IF(B18=0,\"\",IF(OR(C18=\"Nein\",Daten!D20=\"Ohne\"),\"-\",IF(Daten!D$8=\"Rahmendämmung\",Daten!D$10,\"-\")))","v":""},{"$f":"IF(B18=0,\"\",IF(AND(C18=\"Ja\",Daten!D$15=TRUE),Daten!D$16,\"-\"))","v":""},{"$f":"IF(AN18=\"\",\"\",IF(AND(C18=\"Ja\",Daten!D$15=TRUE),Daten!D$18,\"-\"))","v":""},{"$f":"IF(B18=0,\"\",IF(Daten!H$7=TRUE,\"bauseits\",IF(Daten!H$8=TRUE,\"FSP 40\",\"WSP 40\")))","v":""},{"$f":"IF(B18=0,\"\",Daten!H$10)","v":""},{"$f":"IFERROR(IF(B18=0,\"\",IF(Daten!H$2=TRUE,1,0)*IF(J18+P18+P18+Q18+Q18>Daten!B$62,0,1)*IF(K18+P18+Z18+AF18+10>Daten!B$62,0,1)),0)","v":""}]
[null,null,{"$f":"IF(A19=\"\",\"\",IF(Daten!D$1<>\"Keine\",\"Ja\",\"Nein\"))","v":""},{"$f":"IF(A19=\"\",\"\",IF(Daten!B$4=TRUE,\"QB\",\"BS\")&IF(AR19=1,\"G\",\"\")&IF(C19=\"Nein\",\"-V\",IF(Daten!D$11=TRUE,\"-S\",\"-H\"))&IF(Daten!B$1=TRUE,\"-E\",\"\")&IF(Daten!F$9=TRUE,\"-B\",\"\")&IF(Daten!F$8=TRUE,\"A\",\"\"))","v":""},{"$f":"IF(A19=\"\",\"\",IFERROR(VLOOKUP(D19,Daten!D$43:G$94,2,FALSE),\"spez.\"))","v":""},null,null,null,null,{"$f":"IF(F19<>\"\",F19+(2*(Daten!B$13+2)),IF(H19<>\"\",H19-10,\"\"))","v":""},{"$f":"IFERROR(IF(G19<>\"\",G19+Daten!B$14+Daten!B$15+2+IF(AG19=\"-\",0,AG19),IF(I19<>\"\",I19-5,\"\")),\"\")","v":""},{"$f":"IF(B19=0,\"\",IF(L$1=0,0,Daten!B$10))","v":""},{"$f":"IF(B19=0,\"\",IF(M$1=0,0,Daten!B$11))","v":""},{"$f":"IF(B19=0,\"\",IF(N$1=0,0,Daten!B$12))","v":""},"",{"$f":"IF(B19=0,\"\",Daten!B$6)","v":""},{"$f":"IF(B19=0,\"\",Daten!B$16)","v":""},{"$f":"IF(B19=0,\"\",IF(Daten!B$1=TRUE,Daten!B$17,\"-\"))","v":""},{"$f":"IF(B19=0,\"\",IF(C19=\"Nein\",\"-\",Daten!D$7))","v":""},{"$f":"IF(B19=\"\",\"\",IF(C19=\"Nein\",\"-\",IF(T$1=0,\"\",Daten!D$12)))","v":""},{"$f":"IF(B19=\"\",\"\",IF(C19=\"Nein\",\"-\",IF(T$1=0,\"\",Daten!D$13)))","v":""},{"$f":"IF(B19=\"\",\"\",IF(C19=\"Nein\",\"-\",IF(T$1=0,\"\",IF(AK19=\"\",\"\",AK19+X19-Daten!D$20))))","v":""},{"$f":"IF(B19=0,\"\",IF(L$1=1,M19+N19,Daten!D$2))","v":""},{"$f":"IF(B19=0,\"\",IF(C19=\"Nein\",\"-\",Daten!D$6))","v":""},{"$f":"IF(B19=0,\"\",IF(C19=\"Nein\",\"-\",Daten!D$3))","v":""},{"$f":"IF(B19=0,\"\",Daten!D$4)","v":""},{"$f":"IF(B19=0,\"\",IF(C19=\"Nein\",\"-\",Daten!D$5))","v":""},{"$f":"IF(B19=0,\"\",IF(Daten!F$1=\"Keine\",Daten!A$45,IF(Daten!F$7=TRUE,Daten!A$48,Daten!A$44)))","v":""},{"$f":"IF(B19=0,\"\",IF(AB19=\"Standard\",IF(Daten!F$9=TRUE,1,0),0))","v":""},"",{"$f":"IF(B19=0,\"\",IF(OR(AB19=Daten!A$46,AB19=Daten!A$47,AB19=Daten!A$48),AI19+W19,\"-\"))","v":""},{"$f":"IF(B19=0,\"\",IF(AB19=Daten!A$45,\"-\",Daten!F$5))","v":""},{"$f":"IF(B19=0,\"\",IF(AB19=Daten!A$45,\"-\",Daten!F$4))","v":""},{"$f":"IF(B19=0,\"\",IF(AB19=Daten!A$45,\"-\",Daten!F$6))","v":""},{"$f":"IF(B19=0,\"\",IF(AB19=Daten!A$45,\"-\",Daten!F$2))","v":""},{"$f":"IF(B19=0,\"\",IF(AB19=Daten!A$45,\"-\",Daten!F$3))","v":""},"",{"$f":"IF(B19=0,\"\",IF(OR(C19=\"Nein\",Daten!D21=\"Ohne\"),\"-\",Daten!D$9))","v":""},{"$f":"IF(B19=0,\"\",IF(OR(C19=\"Nein\",Daten!D21=\"Ohne\"),\"-\",IF(Daten!D$8=\"Rahmendämmung\",Daten!D$10,\"-\")))","v":""},{"$f":"IF(B19=0,\"\",IF(AND(C19=\"Ja\",Daten!D$15=TRUE),Daten!D$16,\"-\"))","v":""},{"$f":"IF(AN19=\"\",\"\",IF(AND(C19=\"Ja\",Daten!D$15=TRUE),Daten!D$18,\"-\"))","v":""},{"$f":"IF(B19=0,\"\",IF(Daten!H$7=TRUE,\"bauseits\",IF(Daten!H$8=TRUE,\"FSP 40\",\"WSP 40\")))","v":""},{"$f":"IF(B19=0,\"\",Daten!H$10)","v":""},{"$f":"IFERROR(IF(B19=0,\"\",IF(Daten!H$2=TRUE,1,0)*IF(J19+P19+P19+Q19+Q19>Daten!B$62,0,1)*IF(K19+P19+Z19+AF19+10>Daten!B$62,0,1)),0)","v":""}]
[null,null,{"$f":"IF(A20=\"\",\"\",IF(Daten!D$1<>\"Keine\",\"Ja\",\"Nein\"))","v":""},{"$f":"IF(A20=\"\",\"\",IF(Daten!B$4=TRUE,\"QB\",\"BS\")&IF(AR20=1,\"G\",\"\")&IF(C20=\"Nein\",\"-V\",IF(Daten!D$11=TRUE,\"-S\",\"-H\"))&IF(Daten!B$1=TRUE,\"-E\",\"\")&IF(Daten!F$9=TRUE,\"-B\",\"\")&IF(Daten!F$8=TRUE,\"A\",\"\"))","v":""},{"$f":"IF(A20=\"\",\"\",IFERROR(VLOOKUP(D20,Daten!D$43:G$94,2,FALSE),\"spez.\"))","v":""},null,null,null,null,{"$f":"IF(F20<>\"\",F20+(2*(Daten!B$13+2)),IF(H20<>\"\",H20-10,\"\"))","v":""},{"$f":"IFERROR(IF(G20<>\"\",G20+Daten!B$14+Daten!B$15+2+IF(AG20=\"-\",0,AG20),IF(I20<>\"\",I20-5,\"\")),\"\")","v":""},{"$f":"IF(B20=0,\"\",IF(L$1=0,0,Daten!B$10))","v":""},{"$f":"IF(B20=0,\"\",IF(M$1=0,0,Daten!B$11))","v":""},{"$f":"IF(B20=0,\"\",IF(N$1=0,0,Daten!B$12))","v":""},"",{"$f":"IF(B20=0,\"\",Daten!B$6)","v":""},{"$f":"IF(B20=0,\"\",Daten!B$16)","v":""},{"$f":"IF(B20=0,\"\",IF(Daten!B$1=TRUE,Daten!B$17,\"-\"))","v":""},{"$f":"IF(B20=0,\"\",IF(C20=\"Nein\",\"-\",Daten!D$7))","v":""},{"$f":"IF(B20=\"\",\"\",IF(C20=\"Nein\",\"-\",IF(T$1=0,\"\",Daten!D$12)))","v":""},{"$f":"IF(B20=\"\",\"\",IF(C20=\"Nein\",\"-\",IF(T$1=0,\"\",Daten!D$13)))","v":""},{"$f":"IF(B20=\"\",\"\",IF(C20=\"Nein\",\"-\",IF(T$1=0,\"\",IF(AK20=\"\",\"\",AK20+X20-Daten!D$20))))","v":""},{"$f":"IF(B20=0,\"\",IF(L$1=1,M20+N20,Daten!D$2))","v":""},{"$f":"IF(B20=0,\"\",IF(C20=\"Nein\",\"-\",Daten!D$6))","v":""},{"$f":"IF(B20=0,\"\",IF(C20=\"Nein\",\"-\",Daten!D$3))","v":""},{"$f":"IF(B20=0,\"\",Daten!D$4)","v":""},{"$f":"IF(B20=0,\"\",IF(C20=\"Nein\",\"-\",Daten!D$5))","v":""},{"$f":"IF(B20=0,\"\",IF(Daten!F$1=\"Keine\",Daten!A$45,IF(Daten!F$7=TRUE,Daten!A$48,Daten!A$44)))","v":""},{"$f":"IF(B20=0,\"\",IF(AB20=\"Standard\",IF(Daten!F$9=TRUE,1,0),0))","v":""},"",{"$f":"IF(B20=0,\"\",IF(OR(AB20=Daten!A$46,AB20=Daten!A$47,AB20=Daten!A$48),AI20+W20,\"-\"))","v":""},{"$f":"IF(B20=0,\"\",IF(AB20=Daten!A$45,\"-\",Daten!F$5))","v":""},{"$f":"IF(B20=0,\"\",IF(AB20=Daten!A$45,\"-\",Daten!F$4))","v":""},{"$f":"IF(B20=0,\"\",IF(AB20=Daten!A$45,\"-\",Daten!F$6))","v":""},{"$f":"IF(B20=0,\"\",IF(AB20=Daten!A$45,\"-\",Daten!F$2))","v":""},{"$f":"IF(B20=0,\"\",IF(AB20=Daten!A$45,\"-\",Daten!F$3))","v":""},"",{"$f":"IF(B20=0,\"\",IF(OR(C20=\"Nein\",Daten!D22=\"Ohne\"),\"-\",Daten!D$9))","v":""},{"$f":"IF(B20=0,\"\",IF(OR(C20=\"Nein\",Daten!D22=\"Ohne\"),\"-\",IF(Daten!D$8=\"Rahmendämmung\",Daten!D$10,\"-\")))","v":""},{"$f":"IF(B20=0,\"\",IF(AND(C20=\"Ja\",Daten!D$15=TRUE),Daten!D$16,\"-\"))","v":""},{"$f":"IF(AN20=\"\",\"\",IF(AND(C20=\"Ja\",Daten!D$15=TRUE),Daten!D$18,\"-\"))","v":""},{"$f":"IF(B20=0,\"\",IF(Daten!H$7=TRUE,\"bauseits\",IF(Daten!H$8=TRUE,\"FSP 40\",\"WSP 40\")))","v":""},{"$f":"IF(B20=0,\"\",Daten!H$10)","v":""},{"$f":"IFERROR(IF(B20=0,\"\",IF(Daten!H$2=TRUE,1,0)*IF(J20+P20+P20+Q20+Q20>Daten!B$62,0,1)*IF(K20+P20+Z20+AF20+10>Daten!B$62,0,1)),0)","v":""}]
[null,null,{"$f":"IF(A21=\"\",\"\",IF(Daten!D$1<>\"Keine\",\"Ja\",\"Nein\"))","v":""},{"$f":"IF(A21=\"\",\"\",IF(Daten!B$4=TRUE,\"QB\",\"BS\")&IF(AR21=1,\"G\",\"\")&IF(C21=\"Nein\",\"-V\",IF(Daten!D$11=TRUE,\"-S\",\"-H\"))&IF(Daten!B$1=TRUE,\"-E\",\"\")&IF(Daten!F$9=TRUE,\"-B\",\"\")&IF(Daten!F$8=TRUE,\"A\",\"\"))","v":""},{"$f":"IF(A21=\"\",\"\",IFERROR(VLOOKUP(D21,Daten!D$43:G$94,2,FALSE),\"spez.\"))","v":""},null,null,null,null,{"$f":"IF(F21<>\"\",F21+(2*(Daten!B$13+2)),IF(H21<>\"\",H21-10,\"\"))","v":""},{"$f":"IFERROR(IF(G21<>\"\",G21+Daten!B$14+Daten!B$15+2+IF(AG21=\"-\",0,AG21),IF(I21<>\"\",I21-5,\"\")),\"\")","v":""},{"$f":"IF(B21=0,\"\",IF(L$1=0,0,Daten!B$10))","v":""},{"$f":"IF(B21=0,\"\",IF(M$1=0,0,Daten!B$11))","v":""},{"$f":"IF(B21=0,\"\",IF(N$1=0,0,Daten!B$12))","v":""},"",{"$f":"IF(B21=0,\"\",Daten!B$6)","v":""},{"$f":"IF(B21=0,\"\",Daten!B$16)","v":""},{"$f":"IF(B21=0,\"\",IF(Daten!B$1=TRUE,Daten!B$17,\"-\"))","v":""},{"$f":"IF(B21=0,\"\",IF(C21=\"Nein\",\"-\",Daten!D$7))","v":""},{"$f":"IF(B21=\"\",\"\",IF(C21=\"Nein\",\"-\",IF(T$1=0,\"\",Daten!D$12)))","v":""},{"$f":"IF(B21=\"\",\"\",IF(C21=\"Nein\",\"-\",IF(T$1=0,\"\",Daten!D$13)))","v":""},{"$f":"IF(B21=\"\",\"\",IF(C21=\"Nein\",\"-\",IF(T$1=0,\"\",IF(AK21=\"\",\"\",AK21+X21-Daten!D$20))))","v":""},{"$f":"IF(B21=0,\"\",IF(L$1=1,M21+N21,Daten!D$2))","v":""},{"$f":"IF(B21=0,\"\",IF(C21=\"Nein\",\"-\",Daten!D$6))","v":""},{"$f":"IF(B21=0,\"\",IF(C21=\"Nein\",\"-\",Daten!D$3))","v":""},{"$f":"IF(B21=0,\"\",Daten!D$4)","v":""},{"$f":"IF(B21=0,\"\",IF(C21=\"Nein\",\"-\",Daten!D$5))","v":""},{"$f":"IF(B21=0,\"\",IF(Daten!F$1=\"Keine\",Daten!A$45,IF(Daten!F$7=TRUE,Daten!A$48,Daten!A$44)))","v":""},{"$f":"IF(B21=0,\"\",IF(AB21=\"Standard\",IF(Daten!F$9=TRUE,1,0),0))","v":""},"",{"$f":"IF(B21=0,\"\",IF(OR(AB21=Daten!A$46,AB21=Daten!A$47,AB21=Daten!A$48),AI21+W21,\"-\"))","v":""},{"$f":"IF(B21=0,\"\",IF(AB21=Daten!A$45,\"-\",Daten!F$5))","v":""},{"$f":"IF(B21=0,\"\",IF(AB21=Daten!A$45,\"-\",Daten!F$4))","v":""},{"$f":"IF(B21=0,\"\",IF(AB21=Daten!A$45,\"-\",Daten!F$6))","v":""},{"$f":"IF(B21=0,\"\",IF(AB21=Daten!A$45,\"-\",Daten!F$2))","v":""},{"$f":"IF(B21=0,\"\",IF(AB21=Daten!A$45,\"-\",Daten!F$3))","v":""},"",{"$f":"IF(B21=0,\"\",IF(OR(C21=\"Nein\",Daten!D23=\"Ohne\"),\"-\",Daten!D$9))","v":""},{"$f":"IF(B21=0,\"\",IF(OR(C21=\"Nein\",Daten!D23=\"Ohne\"),\"-\",IF(Daten!D$8=\"Rahmendämmung\",Daten!D$10,\"-\")))","v":""},{"$f":"IF(B21=0,\"\",IF(AND(C21=\"Ja\",Daten!D$15=TRUE),Daten!D$16,\"-\"))","v":""},{"$f":"IF(AN21=\"\",\"\",IF(AND(C21=\"Ja\",Daten!D$15=TRUE),Daten!D$18,\"-\"))","v":""},{"$f":"IF(B21=0,\"\",IF(Daten!H$7=TRUE,\"bauseits\",IF(Daten!H$8=TRUE,\"FSP 40\",\"WSP 40\")))","v":""},{"$f":"IF(B21=0,\"\",Daten!H$10)","v":""},{"$f":"IFERROR(IF(B21=0,\"\",IF(Daten!H$2=TRUE,1,0)*IF(J21+P21+P21+Q21+Q21>Daten!B$62,0,1)*IF(K21+P21+Z21+AF21+10>Daten!B$62,0,1)),0)","v":""}]
[null,null,{"$f":"IF(A22=\"\",\"\",IF(Daten!D$1<>\"Keine\",\"Ja\",\"Nein\"))","v":""},{"$f":"IF(A22=\"\",\"\",IF(Daten!B$4=TRUE,\"QB\",\"BS\")&IF(AR22=1,\"G\",\"\")&IF(C22=\"Nein\",\"-V\",IF(Daten!D$11=TRUE,\"-S\",\"-H\"))&IF(Daten!B$1=TRUE,\"-E\",\"\")&IF(Daten!F$9=TRUE,\"-B\",\"\")&IF(Daten!F$8=TRUE,\"A\",\"\"))","v":""},{"$f":"IF(A22=\"\",\"\",IFERROR(VLOOKUP(D22,Daten!D$43:G$94,2,FALSE),\"spez.\"))","v":""},null,null,null,null,{"$f":"IF(F22<>\"\",F22+(2*(Daten!B$13+2)),IF(H22<>\"\",H22-10,\"\"))","v":""},{"$f":"IFERROR(IF(G22<>\"\",G22+Daten!B$14+Daten!B$15+2+IF(AG22=\"-\",0,AG22),IF(I22<>\"\",I22-5,\"\")),\"\")","v":""},{"$f":"IF(B22=0,\"\",IF(L$1=0,0,Daten!B$10))","v":""},{"$f":"IF(B22=0,\"\",IF(M$1=0,0,Daten!B$11))","v":""},{"$f":"IF(B22=0,\"\",IF(N$1=0,0,Daten!B$12))","v":""},"",{"$f":"IF(B22=0,\"\",Daten!B$6)","v":""},{"$f":"IF(B22=0,\"\",Daten!B$16)","v":""},{"$f":"IF(B22=0,\"\",IF(Daten!B$1=TRUE,Daten!B$17,\"-\"))","v":""},{"$f":"IF(B22=0,\"\",IF(C22=\"Nein\",\"-\",Daten!D$7))","v":""},{"$f":"IF(B22=\"\",\"\",IF(C22=\"Nein\",\"-\",IF(T$1=0,\"\",Daten!D$12)))","v":""},{"$f":"IF(B22=\"\",\"\",IF(C22=\"Nein\",\"-\",IF(T$1=0,\"\",Daten!D$13)))","v":""},{"$f":"IF(B22=\"\",\"\",IF(C22=\"Nein\",\"-\",IF(T$1=0,\"\",IF(AK22=\"\",\"\",AK22+X22-Daten!D$20))))","v":""},{"$f":"IF(B22=0,\"\",IF(L$1=1,M22+N22,Daten!D$2))","v":""},{"$f":"IF(B22=0,\"\",IF(C22=\"Nein\",\"-\",Daten!D$6))","v":""},{"$f":"IF(B22=0,\"\",IF(C22=\"Nein\",\"-\",Daten!D$3))","v":""},{"$f":"IF(B22=0,\"\",Daten!D$4)","v":""},{"$f":"IF(B22=0,\"\",IF(C22=\"Nein\",\"-\",Daten!D$5))","v":""},{"$f":"IF(B22=0,\"\",IF(Daten!F$1=\"Keine\",Daten!A$45,IF(Daten!F$7=TRUE,Daten!A$48,Daten!A$44)))","v":""},{"$f":"IF(B22=0,\"\",IF(AB22=\"Standard\",IF(Daten!F$9=TRUE,1,0),0))","v":""},"",{"$f":"IF(B22=0,\"\",IF(OR(AB22=Daten!A$46,AB22=Daten!A$47,AB22=Daten!A$48),AI22+W22,\"-\"))","v":""},{"$f":"IF(B22=0,\"\",IF(AB22=Daten!A$45,\"-\",Daten!F$5))","v":""},{"$f":"IF(B22=0,\"\",IF(AB22=Daten!A$45,\"-\",Daten!F$4))","v":""},{"$f":"IF(B22=0,\"\",IF(AB22=Daten!A$45,\"-\",Daten!F$6))","v":""},{"$f":"IF(B22=0,\"\",IF(AB22=Daten!A$45,\"-\",Daten!F$2))","v":""},{"$f":"IF(B22=0,\"\",IF(AB22=Daten!A$45,\"-\",Daten!F$3))","v":""},"",{"$f":"IF(B22=0,\"\",IF(OR(C22=\"Nein\",Daten!D24=\"Ohne\"),\"-\",Daten!D$9))","v":""},{"$f":"IF(B22=0,\"\",IF(OR(C22=\"Nein\",Daten!D24=\"Ohne\"),\"-\",IF(Daten!D$8=\"Rahmendämmung\",Daten!D$10,\"-\")))","v":""},{"$f":"IF(B22=0,\"\",IF(AND(C22=\"Ja\",Daten!D$15=TRUE),Daten!D$16,\"-\"))","v":""},{"$f":"IF(AN22=\"\",\"\",IF(AND(C22=\"Ja\",Daten!D$15=TRUE),Daten!D$18,\"-\"))","v":""},{"$f":"IF(B22=0,\"\",IF(Daten!H$7=TRUE,\"bauseits\",IF(Daten!H$8=TRUE,\"FSP 40\",\"WSP 40\")))","v":""},{"$f":"IF(B22=0,\"\",Daten!H$10)","v":""},{"$f":"IFERROR(IF(B22=0,\"\",IF(Daten!H$2=TRUE,1,0)*IF(J22+P22+P22+Q22+Q22>Daten!B$62,0,1)*IF(K22+P22+Z22+AF22+10>Daten!B$62,0,1)),0)","v":""}]
[null,null,{"$f":"IF(A23=\"\",\"\",IF(Daten!D$1<>\"Keine\",\"Ja\",\"Nein\"))","v":""},{"$f":"IF(A23=\"\",\"\",IF(Daten!B$4=TRUE,\"QB\",\"BS\")&IF(AR23=1,\"G\",\"\")&IF(C23=\"Nein\",\"-V\",IF(Daten!D$11=TRUE,\"-S\",\"-H\"))&IF(Daten!B$1=TRUE,\"-E\",\"\")&IF(Daten!F$9=TRUE,\"-B\",\"\")&IF(Daten!F$8=TRUE,\"A\",\"\"))","v":""},{"$f":"IF(A23=\"\",\"\",IFERROR(VLOOKUP(D23,Daten!D$43:G$94,2,FALSE),\"spez.\"))","v":""},null,null,null,null,{"$f":"IF(F23<>\"\",F23+(2*(Daten!B$13+2)),IF(H23<>\"\",H23-10,\"\"))","v":""},{"$f":"IFERROR(IF(G23<>\"\",G23+Daten!B$14+Daten!B$15+2+IF(AG23=\"-\",0,AG23),IF(I23<>\"\",I23-5,\"\")),\"\")","v":""},{"$f":"IF(B23=0,\"\",IF(L$1=0,0,Daten!B$10))","v":""},{"$f":"IF(B23=0,\"\",IF(M$1=0,0,Daten!B$11))","v":""},{"$f":"IF(B23=0,\"\",IF(N$1=0,0,Daten!B$12))","v":""},"",{"$f":"IF(B23=0,\"\",Daten!B$6)","v":""},{"$f":"IF(B23=0,\"\",Daten!B$16)","v":""},{"$f":"IF(B23=0,\"\",IF(Daten!B$1=TRUE,Daten!B$17,\"-\"))","v":""},{"$f":"IF(B23=0,\"\",IF(C23=\"Nein\",\"-\",Daten!D$7))","v":""},{"$f":"IF(B23=\"\",\"\",IF(C23=\"Nein\",\"-\",IF(T$1=0,\"\",Daten!D$12)))","v":""},{"$f":"IF(B23=\"\",\"\",IF(C23=\"Nein\",\"-\",IF(T$1=0,\"\",Daten!D$13)))","v":""},{"$f":"IF(B23=\"\",\"\",IF(C23=\"Nein\",\"-\",IF(T$1=0,\"\",IF(AK23=\"\",\"\",AK23+X23-Daten!D$20))))","v":""},{"$f":"IF(B23=0,\"\",IF(L$1=1,M23+N23,Daten!D$2))","v":""},{"$f":"IF(B23=0,\"\",IF(C23=\"Nein\",\"-\",Daten!D$6))","v":""},{"$f":"IF(B23=0,\"\",IF(C23=\"Nein\",\"-\",Daten!D$3))","v":""},{"$f":"IF(B23=0,\"\",Daten!D$4)","v":""},{"$f":"IF(B23=0,\"\",IF(C23=\"Nein\",\"-\",Daten!D$5))","v":""},{"$f":"IF(B23=0,\"\",IF(Daten!F$1=\"Keine\",Daten!A$45,IF(Daten!F$7=TRUE,Daten!A$48,Daten!A$44)))","v":""},{"$f":"IF(B23=0,\"\",IF(AB23=\"Standard\",IF(Daten!F$9=TRUE,1,0),0))","v":""},"",{"$f":"IF(B23=0,\"\",IF(OR(AB23=Daten!A$46,AB23=Daten!A$47,AB23=Daten!A$48),AI23+W23,\"-\"))","v":""},{"$f":"IF(B23=0,\"\",IF(AB23=Daten!A$45,\"-\",Daten!F$5))","v":""},{"$f":"IF(B23=0,\"\",IF(AB23=Daten!A$45,\"-\",Daten!F$4))","v":""},{"$f":"IF(B23=0,\"\",IF(AB23=Daten!A$45,\"-\",Daten!F$6))","v":""},{"$f":"IF(B23=0,\"\",IF(AB23=Daten!A$45,\"-\",Daten!F$2))","v":""},{"$f":"IF(B23=0,\"\",IF(AB23=Daten!A$45,\"-\",Daten!F$3))","v":""},"",{"$f":"IF(B23=0,\"\",IF(OR(C23=\"Nein\",Daten!D25=\"Ohne\"),\"-\",Daten!D$9))","v":""},{"$f":"IF(B23=0,\"\",IF(OR(C23=\"Nein\",Daten!D25=\"Ohne\"),\"-\",IF(Daten!D$8=\"Rahmendämmung\",Daten!D$10,\"-\")))","v":""},{"$f":"IF(B23=0,\"\",IF(AND(C23=\"Ja\",Daten!D$15=TRUE),Daten!D$16,\"-\"))","v":""},{"$f":"IF(AN23=\"\",\"\",IF(AND(C23=\"Ja\",Daten!D$15=TRUE),Daten!D$18,\"-\"))","v":""},{"$f":"IF(B23=0,\"\",IF(Daten!H$7=TRUE,\"bauseits\",IF(Daten!H$8=TRUE,\"FSP 40\",\"WSP 40\")))","v":""},{"$f":"IF(B23=0,\"\",Daten!H$10)","v":""},{"$f":"IFERROR(IF(B23=0,\"\",IF(Daten!H$2=TRUE,1,0)*IF(J23+P23+P23+Q23+Q23>Daten!B$62,0,1)*IF(K23+P23+Z23+AF23+10>Daten!B$62,0,1)),0)","v":""}]
[null,null,{"$f":"IF(A24=\"\",\"\",IF(Daten!D$1<>\"Keine\",\"Ja\",\"Nein\"))","v":""},{"$f":"IF(A24=\"\",\"\",IF(Daten!B$4=TRUE,\"QB\",\"BS\")&IF(AR24=1,\"G\",\"\")&IF(C24=\"Nein\",\"-V\",IF(Daten!D$11=TRUE,\"-S\",\"-H\"))&IF(Daten!B$1=TRUE,\"-E\",\"\")&IF(Daten!F$9=TRUE,\"-B\",\"\")&IF(Daten!F$8=TRUE,\"A\",\"\"))","v":""},{"$f":"IF(A24=\"\",\"\",IFERROR(VLOOKUP(D24,Daten!D$43:G$94,2,FALSE),\"spez.\"))","v":""},null,null,null,null,{"$f":"IF(F24<>\"\",F24+(2*(Daten!B$13+2)),IF(H24<>\"\",H24-10,\"\"))","v":""},{"$f":"IFERROR(IF(G24<>\"\",G24+Daten!B$14+Daten!B$15+2+IF(AG24=\"-\",0,AG24),IF(I24<>\"\",I24-5,\"\")),\"\")","v":""},{"$f":"IF(B24=0,\"\",IF(L$1=0,0,Daten!B$10))","v":""},{"$f":"IF(B24=0,\"\",IF(M$1=0,0,Daten!B$11))","v":""},{"$f":"IF(B24=0,\"\",IF(N$1=0,0,Daten!B$12))","v":""},"",{"$f":"IF(B24=0,\"\",Daten!B$6)","v":""},{"$f":"IF(B24=0,\"\",Daten!B$16)","v":""},{"$f":"IF(B24=0,\"\",IF(Daten!B$1=TRUE,Daten!B$17,\"-\"))","v":""},{"$f":"IF(B24=0,\"\",IF(C24=\"Nein\",\"-\",Daten!D$7))","v":""},{"$f":"IF(B24=\"\",\"\",IF(C24=\"Nein\",\"-\",IF(T$1=0,\"\",Daten!D$12)))","v":""},{"$f":"IF(B24=\"\",\"\",IF(C24=\"Nein\",\"-\",IF(T$1=0,\"\",Daten!D$13)))","v":""},{"$f":"IF(B24=\"\",\"\",IF(C24=\"Nein\",\"-\",IF(T$1=0,\"\",IF(AK24=\"\",\"\",AK24+X24-Daten!D$20))))","v":""},{"$f":"IF(B24=0,\"\",IF(L$1=1,M24+N24,Daten!D$2))","v":""},{"$f":"IF(B24=0,\"\",IF(C24=\"Nein\",\"-\",Daten!D$6))","v":""},{"$f":"IF(B24=0,\"\",IF(C24=\"Nein\",\"-\",Daten!D$3))","v":""},{"$f":"IF(B24=0,\"\",Daten!D$4)","v":""},{"$f":"IF(B24=0,\"\",IF(C24=\"Nein\",\"-\",Daten!D$5))","v":""},{"$f":"IF(B24=0,\"\",IF(Daten!F$1=\"Keine\",Daten!A$45,IF(Daten!F$7=TRUE,Daten!A$48,Daten!A$44)))","v":""},{"$f":"IF(B24=0,\"\",IF(AB24=\"Standard\",IF(Daten!F$9=TRUE,1,0),0))","v":""},"",{"$f":"IF(B24=0,\"\",IF(OR(AB24=Daten!A$46,AB24=Daten!A$47,AB24=Daten!A$48),AI24+W24,\"-\"))","v":""},{"$f":"IF(B24=0,\"\",IF(AB24=Daten!A$45,\"-\",Daten!F$5))","v":""},{"$f":"IF(B24=0,\"\",IF(AB24=Daten!A$45,\"-\",Daten!F$4))","v":""},{"$f":"IF(B24=0,\"\",IF(AB24=Daten!A$45,\"-\",Daten!F$6))","v":""},{"$f":"IF(B24=0,\"\",IF(AB24=Daten!A$45,\"-\",Daten!F$2))","v":""},{"$f":"IF(B24=0,\"\",IF(AB24=Daten!A$45,\"-\",Daten!F$3))","v":""},"",{"$f":"IF(B24=0,\"\",IF(OR(C24=\"Nein\",Daten!D26=\"Ohne\"),\"-\",Daten!D$9))","v":""},{"$f":"IF(B24=0,\"\",IF(OR(C24=\"Nein\",Daten!D26=\"Ohne\"),\"-\",IF(Daten!D$8=\"Rahmendämmung\",Daten!D$10,\"-\")))","v":""},{"$f":"IF(B24=0,\"\",IF(AND(C24=\"Ja\",Daten!D$15=TRUE),Daten!D$16,\"-\"))","v":""},{"$f":"IF(AN24=\"\",\"\",IF(AND(C24=\"Ja\",Daten!D$15=TRUE),Daten!D$18,\"-\"))","v":""},{"$f":"IF(B24=0,\"\",IF(Daten!H$7=TRUE,\"bauseits\",IF(Daten!H$8=TRUE,\"FSP 40\",\"WSP 40\")))","v":""},{"$f":"IF(B24=0,\"\",Daten!H$10)","v":""},{"$f":"IFERROR(IF(B24=0,\"\",IF(Daten!H$2=TRUE,1,0)*IF(J24+P24+P24+Q24+Q24>Daten!B$62,0,1)*IF(K24+P24+Z24+AF24+10>Daten!B$62,0,1)),0)","v":""}]
[null,null,{"$f":"IF(A25=\"\",\"\",IF(Daten!D$1<>\"Keine\",\"Ja\",\"Nein\"))","v":""},{"$f":"IF(A25=\"\",\"\",IF(Daten!B$4=TRUE,\"QB\",\"BS\")&IF(AR25=1,\"G\",\"\")&IF(C25=\"Nein\",\"-V\",IF(Daten!D$11=TRUE,\"-S\",\"-H\"))&IF(Daten!B$1=TRUE,\"-E\",\"\")&IF(Daten!F$9=TRUE,\"-B\",\"\")&IF(Daten!F$8=TRUE,\"A\",\"\"))","v":""},{"$f":"IF(A25=\"\",\"\",IFERROR(VLOOKUP(D25,Daten!D$43:G$94,2,FALSE),\"spez.\"))","v":""},null,null,null,null,{"$f":"IF(F25<>\"\",F25+(2*(Daten!B$13+2)),IF(H25<>\"\",H25-10,\"\"))","v":""},{"$f":"IFERROR(IF(G25<>\"\",G25+Daten!B$14+Daten!B$15+2+IF(AG25=\"-\",0,AG25),IF(I25<>\"\",I25-5,\"\")),\"\")","v":""},{"$f":"IF(B25=0,\"\",IF(L$1=0,0,Daten!B$10))","v":""},{"$f":"IF(B25=0,\"\",IF(M$1=0,0,Daten!B$11))","v":""},{"$f":"IF(B25=0,\"\",IF(N$1=0,0,Daten!B$12))","v":""},"",{"$f":"IF(B25=0,\"\",Daten!B$6)","v":""},{"$f":"IF(B25=0,\"\",Daten!B$16)","v":""},{"$f":"IF(B25=0,\"\",IF(Daten!B$1=TRUE,Daten!B$17,\"-\"))","v":""},{"$f":"IF(B25=0,\"\",IF(C25=\"Nein\",\"-\",Daten!D$7))","v":""},{"$f":"IF(B25=\"\",\"\",IF(C25=\"Nein\",\"-\",IF(T$1=0,\"\",Daten!D$12)))","v":""},{"$f":"IF(B25=\"\",\"\",IF(C25=\"Nein\",\"-\",IF(T$1=0,\"\",Daten!D$13)))","v":""},{"$f":"IF(B25=\"\",\"\",IF(C25=\"Nein\",\"-\",IF(T$1=0,\"\",IF(AK25=\"\",\"\",AK25+X25-Daten!D$20))))","v":""},{"$f":"IF(B25=0,\"\",IF(L$1=1,M25+N25,Daten!D$2))","v":""},{"$f":"IF(B25=0,\"\",IF(C25=\"Nein\",\"-\",Daten!D$6))","v":""},{"$f":"IF(B25=0,\"\",IF(C25=\"Nein\",\"-\",Daten!D$3))","v":""},{"$f":"IF(B25=0,\"\",Daten!D$4)","v":""},{"$f":"IF(B25=0,\"\",IF(C25=\"Nein\",\"-\",Daten!D$5))","v":""},{"$f":"IF(B25=0,\"\",IF(Daten!F$1=\"Keine\",Daten!A$45,IF(Daten!F$7=TRUE,Daten!A$48,Daten!A$44)))","v":""},{"$f":"IF(B25=0,\"\",IF(AB25=\"Standard\",IF(Daten!F$9=TRUE,1,0),0))","v":""},"",{"$f":"IF(B25=0,\"\",IF(OR(AB25=Daten!A$46,AB25=Daten!A$47,AB25=Daten!A$48),AI25+W25,\"-\"))","v":""},{"$f":"IF(B25=0,\"\",IF(AB25=Daten!A$45,\"-\",Daten!F$5))","v":""},{"$f":"IF(B25=0,\"\",IF(AB25=Daten!A$45,\"-\",Daten!F$4))","v":""},{"$f":"IF(B25=0,\"\",IF(AB25=Daten!A$45,\"-\",Daten!F$6))","v":""},{"$f":"IF(B25=0,\"\",IF(AB25=Daten!A$45,\"-\",Daten!F$2))","v":""},{"$f":"IF(B25=0,\"\",IF(AB25=Daten!A$45,\"-\",Daten!F$3))","v":""},"",{"$f":"IF(B25=0,\"\",IF(OR(C25=\"Nein\",Daten!D27=\"Ohne\"),\"-\",Daten!D$9))","v":""},{"$f":"IF(B25=0,\"\",IF(OR(C25=\"Nein\",Daten!D27=\"Ohne\"),\"-\",IF(Daten!D$8=\"Rahmendämmung\",Daten!D$10,\"-\")))","v":""},{"$f":"IF(B25=0,\"\",IF(AND(C25=\"Ja\",Daten!D$15=TRUE),Daten!D$16,\"-\"))","v":""},{"$f":"IF(AN25=\"\",\"\",IF(AND(C25=\"Ja\",Daten!D$15=TRUE),Daten!D$18,\"-\"))","v":""},{"$f":"IF(B25=0,\"\",IF(Daten!H$7=TRUE,\"bauseits\",IF(Daten!H$8=TRUE,\"FSP 40\",\"WSP 40\")))","v":""},{"$f":"IF(B25=0,\"\",Daten!H$10)","v":""},{"$f":"IFERROR(IF(B25=0,\"\",IF(Daten!H$2=TRUE,1,0)*IF(J25+P25+P25+Q25+Q25>Daten!B$62,0,1)*IF(K25+P25+Z25+AF25+10>Daten!B$62,0,1)),0)","v":""}]
[null,null,{"$f":"IF(A26=\"\",\"\",IF(Daten!D$1<>\"Keine\",\"Ja\",\"Nein\"))","v":""},{"$f":"IF(A26=\"\",\"\",IF(Daten!B$4=TRUE,\"QB\",\"BS\")&IF(AR26=1,\"G\",\"\")&IF(C26=\"Nein\",\"-V\",IF(Daten!D$11=TRUE,\"-S\",\"-H\"))&IF(Daten!B$1=TRUE,\"-E\",\"\")&IF(Daten!F$9=TRUE,\"-B\",\"\")&IF(Daten!F$8=TRUE,\"A\",\"\"))","v":""},{"$f":"IF(A26=\"\",\"\",IFERROR(VLOOKUP(D26,Daten!D$43:G$94,2,FALSE),\"spez.\"))","v":""},null,null,null,null,{"$f":"IF(F26<>\"\",F26+(2*(Daten!B$13+2)),IF(H26<>\"\",H26-10,\"\"))","v":""},{"$f":"IFERROR(IF(G26<>\"\",G26+Daten!B$14+Daten!B$15+2+IF(AG26=\"-\",0,AG26),IF(I26<>\"\",I26-5,\"\")),\"\")","v":""},{"$f":"IF(B26=0,\"\",IF(L$1=0,0,Daten!B$10))","v":""},{"$f":"IF(B26=0,\"\",IF(M$1=0,0,Daten!B$11))","v":""},{"$f":"IF(B26=0,\"\",IF(N$1=0,0,Daten!B$12))","v":""},"",{"$f":"IF(B26=0,\"\",Daten!B$6)","v":""},{"$f":"IF(B26=0,\"\",Daten!B$16)","v":""},{"$f":"IF(B26=0,\"\",IF(Daten!B$1=TRUE,Daten!B$17,\"-\"))","v":""},{"$f":"IF(B26=0,\"\",IF(C26=\"Nein\",\"-\",Daten!D$7))","v":""},{"$f":"IF(B26=\"\",\"\",IF(C26=\"Nein\",\"-\",IF(T$1=0,\"\",Daten!D$12)))","v":""},{"$f":"IF(B26=\"\",\"\",IF(C26=\"Nein\",\"-\",IF(T$1=0,\"\",Daten!D$13)))","v":""},{"$f":"IF(B26=\"\",\"\",IF(C26=\"Nein\",\"-\",IF(T$1=0,\"\",IF(AK26=\"\",\"\",AK26+X26-Daten!D$20))))","v":""},{"$f":"IF(B26=0,\"\",IF(L$1=1,M26+N26,Daten!D$2))","v":""},{"$f":"IF(B26=0,\"\",IF(C26=\"Nein\",\"-\",Daten!D$6))","v":""},{"$f":"IF(B26=0,\"\",IF(C26=\"Nein\",\"-\",Daten!D$3))","v":""},{"$f":"IF(B26=0,\"\",Daten!D$4)","v":""},{"$f":"IF(B26=0,\"\",IF(C26=\"Nein\",\"-\",Daten!D$5))","v":""},{"$f":"IF(B26=0,\"\",IF(Daten!F$1=\"Keine\",Daten!A$45,IF(Daten!F$7=TRUE,Daten!A$48,Daten!A$44)))","v":""},{"$f":"IF(B26=0,\"\",IF(AB26=\"Standard\",IF(Daten!F$9=TRUE,1,0),0))","v":""},"",{"$f":"IF(B26=0,\"\",IF(OR(AB26=Daten!A$46,AB26=Daten!A$47,AB26=Daten!A$48),AI26+W26,\"-\"))","v":""},{"$f":"IF(B26=0,\"\",IF(AB26=Daten!A$45,\"-\",Daten!F$5))","v":""},{"$f":"IF(B26=0,\"\",IF(AB26=Daten!A$45,\"-\",Daten!F$4))","v":""},{"$f":"IF(B26=0,\"\",IF(AB26=Daten!A$45,\"-\",Daten!F$6))","v":""},{"$f":"IF(B26=0,\"\",IF(AB26=Daten!A$45,\"-\",Daten!F$2))","v":""},{"$f":"IF(B26=0,\"\",IF(AB26=Daten!A$45,\"-\",Daten!F$3))","v":""},"",{"$f":"IF(B26=0,\"\",IF(OR(C26=\"Nein\",Daten!D28=\"Ohne\"),\"-\",Daten!D$9))","v":""},{"$f":"IF(B26=0,\"\",IF(OR(C26=\"Nein\",Daten!D28=\"Ohne\"),\"-\",IF(Daten!D$8=\"Rahmendämmung\",Daten!D$10,\"-\")))","v":""},{"$f":"IF(B26=0,\"\",IF(AND(C26=\"Ja\",Daten!D$15=TRUE),Daten!D$16,\"-\"))","v":""},{"$f":"IF(AN26=\"\",\"\",IF(AND(C26=\"Ja\",Daten!D$15=TRUE),Daten!D$18,\"-\"))","v":""},{"$f":"IF(B26=0,\"\",IF(Daten!H$7=TRUE,\"bauseits\",IF(Daten!H$8=TRUE,\"FSP 40\",\"WSP 40\")))","v":""},{"$f":"IF(B26=0,\"\",Daten!H$10)","v":""},{"$f":"IFERROR(IF(B26=0,\"\",IF(Daten!H$2=TRUE,1,0)*IF(J26+P26+P26+Q26+Q26>Daten!B$62,0,1)*IF(K26+P26+Z26+AF26+10>Daten!B$62,0,1)),0)","v":""}]
[null,null,{"$f":"IF(A27=\"\",\"\",IF(Daten!D$1<>\"Keine\",\"Ja\",\"Nein\"))","v":""},{"$f":"IF(A27=\"\",\"\",IF(Daten!B$4=TRUE,\"QB\",\"BS\")&IF(AR27=1,\"G\",\"\")&IF(C27=\"Nein\",\"-V\",IF(Daten!D$11=TRUE,\"-S\",\"-H\"))&IF(Daten!B$1=TRUE,\"-E\",\"\")&IF(Daten!F$9=TRUE,\"-B\",\"\")&IF(Daten!F$8=TRUE,\"A\",\"\"))","v":""},{"$f":"IF(A27=\"\",\"\",IFERROR(VLOOKUP(D27,Daten!D$43:G$94,2,FALSE),\"spez.\"))","v":""},null,null,null,null,{"$f":"IF(F27<>\"\",F27+(2*(Daten!B$13+2)),IF(H27<>\"\",H27-10,\"\"))","v":""},{"$f":"IFERROR(IF(G27<>\"\",G27+Daten!B$14+Daten!B$15+2+IF(AG27=\"-\",0,AG27),IF(I27<>\"\",I27-5,\"\")),\"\")","v":""},{"$f":"IF(B27=0,\"\",IF(L$1=0,0,Daten!B$10))","v":""},{"$f":"IF(B27=0,\"\",IF(M$1=0,0,Daten!B$11))","v":""},{"$f":"IF(B27=0,\"\",IF(N$1=0,0,Daten!B$12))","v":""},"",{"$f":"IF(B27=0,\"\",Daten!B$6)","v":""},{"$f":"IF(B27=0,\"\",Daten!B$16)","v":""},{"$f":"IF(B27=0,\"\",IF(Daten!B$1=TRUE,Daten!B$17,\"-\"))","v":""},{"$f":"IF(B27=0,\"\",IF(C27=\"Nein\",\"-\",Daten!D$7))","v":""},{"$f":"IF(B27=\"\",\"\",IF(C27=\"Nein\",\"-\",IF(T$1=0,\"\",Daten!D$12)))","v":""},{"$f":"IF(B27=\"\",\"\",IF(C27=\"Nein\",\"-\",IF(T$1=0,\"\",Daten!D$13)))","v":""},{"$f":"IF(B27=\"\",\"\",IF(C27=\"Nein\",\"-\",IF(T$1=0,\"\",IF(AK27=\"\",\"\",AK27+X27-Daten!D$20))))","v":""},{"$f":"IF(B27=0,\"\",IF(L$1=1,M27+N27,Daten!D$2))","v":""},{"$f":"IF(B27=0,\"\",IF(C27=\"Nein\",\"-\",Daten!D$6))","v":""},{"$f":"IF(B27=0,\"\",IF(C27=\"Nein\",\"-\",Daten!D$3))","v":""},{"$f":"IF(B27=0,\"\",Daten!D$4)","v":""},{"$f":"IF(B27=0,\"\",IF(C27=\"Nein\",\"-\",Daten!D$5))","v":""},{"$f":"IF(B27=0,\"\",IF(Daten!F$1=\"Keine\",Daten!A$45,IF(Daten!F$7=TRUE,Daten!A$48,Daten!A$44)))","v":""},{"$f":"IF(B27=0,\"\",IF(AB27=\"Standard\",IF(Daten!F$9=TRUE,1,0),0))","v":""},"",{"$f":"IF(B27=0,\"\",IF(OR(AB27=Daten!A$46,AB27=Daten!A$47,AB27=Daten!A$48),AI27+W27,\"-\"))","v":""},{"$f":"IF(B27=0,\"\",IF(AB27=Daten!A$45,\"-\",Daten!F$5))","v":""},{"$f":"IF(B27=0,\"\",IF(AB27=Daten!A$45,\"-\",Daten!F$4))","v":""},{"$f":"IF(B27=0,\"\",IF(AB27=Daten!A$45,\"-\",Daten!F$6))","v":""},{"$f":"IF(B27=0,\"\",IF(AB27=Daten!A$45,\"-\",Daten!F$2))","v":""},{"$f":"IF(B27=0,\"\",IF(AB27=Daten!A$45,\"-\",Daten!F$3))","v":""},"",{"$f":"IF(B27=0,\"\",IF(OR(C27=\"Nein\",Daten!D29=\"Ohne\"),\"-\",Daten!D$9))","v":""},{"$f":"IF(B27=0,\"\",IF(OR(C27=\"Nein\",Daten!D29=\"Ohne\"),\"-\",IF(Daten!D$8=\"Rahmendämmung\",Daten!D$10,\"-\")))","v":""},{"$f":"IF(B27=0,\"\",IF(AND(C27=\"Ja\",Daten!D$15=TRUE),Daten!D$16,\"-\"))","v":""},{"$f":"IF(AN27=\"\",\"\",IF(AND(C27=\"Ja\",Daten!D$15=TRUE),Daten!D$18,\"-\"))","v":""},{"$f":"IF(B27=0,\"\",IF(Daten!H$7=TRUE,\"bauseits\",IF(Daten!H$8=TRUE,\"FSP 40\",\"WSP 40\")))","v":""},{"$f":"IF(B27=0,\"\",Daten!H$10)","v":""},{"$f":"IFERROR(IF(B27=0,\"\",IF(Daten!H$2=TRUE,1,0)*IF(J27+P27+P27+Q27+Q27>Daten!B$62,0,1)*IF(K27+P27+Z27+AF27+10>Daten!B$62,0,1)),0)","v":""}]
[null,null,{"$f":"IF(A28=\"\",\"\",IF(Daten!D$1<>\"Keine\",\"Ja\",\"Nein\"))","v":""},{"$f":"IF(A28=\"\",\"\",IF(Daten!B$4=TRUE,\"QB\",\"BS\")&IF(AR28=1,\"G\",\"\")&IF(C28=\"Nein\",\"-V\",IF(Daten!D$11=TRUE,\"-S\",\"-H\"))&IF(Daten!B$1=TRUE,\"-E\",\"\")&IF(Daten!F$9=TRUE,\"-B\",\"\")&IF(Daten!F$8=TRUE,\"A\",\"\"))","v":""},{"$f":"IF(A28=\"\",\"\",IFERROR(VLOOKUP(D28,Daten!D$43:G$94,2,FALSE),\"spez.\"))","v":""},null,null,null,null,{"$f":"IF(F28<>\"\",F28+(2*(Daten!B$13+2)),IF(H28<>\"\",H28-10,\"\"))","v":""},{"$f":"IFERROR(IF(G28<>\"\",G28+Daten!B$14+Daten!B$15+2+IF(AG28=\"-\",0,AG28),IF(I28<>\"\",I28-5,\"\")),\"\")","v":""},{"$f":"IF(B28=0,\"\",IF(L$1=0,0,Daten!B$10))","v":""},{"$f":"IF(B28=0,\"\",IF(M$1=0,0,Daten!B$11))","v":""},{"$f":"IF(B28=0,\"\",IF(N$1=0,0,Daten!B$12))","v":""},"",{"$f":"IF(B28=0,\"\",Daten!B$6)","v":""},{"$f":"IF(B28=0,\"\",Daten!B$16)","v":""},{"$f":"IF(B28=0,\"\",IF(Daten!B$1=TRUE,Daten!B$17,\"-\"))","v":""},{"$f":"IF(B28=0,\"\",IF(C28=\"Nein\",\"-\",Daten!D$7))","v":""},{"$f":"IF(B28=\"\",\"\",IF(C28=\"Nein\",\"-\",IF(T$1=0,\"\",Daten!D$12)))","v":""},{"$f":"IF(B28=\"\",\"\",IF(C28=\"Nein\",\"-\",IF(T$1=0,\"\",Daten!D$13)))","v":""},{"$f":"IF(B28=\"\",\"\",IF(C28=\"Nein\",\"-\",IF(T$1=0,\"\",IF(AK28=\"\",\"\",AK28+X28-Daten!D$20))))","v":""},{"$f":"IF(B28=0,\"\",IF(L$1=1,M28+N28,Daten!D$2))","v":""},{"$f":"IF(B28=0,\"\",IF(C28=\"Nein\",\"-\",Daten!D$6))","v":""},{"$f":"IF(B28=0,\"\",IF(C28=\"Nein\",\"-\",Daten!D$3))","v":""},{"$f":"IF(B28=0,\"\",Daten!D$4)","v":""},{"$f":"IF(B28=0,\"\",IF(C28=\"Nein\",\"-\",Daten!D$5))","v":""},{"$f":"IF(B28=0,\"\",IF(Daten!F$1=\"Keine\",Daten!A$45,IF(Daten!F$7=TRUE,Daten!A$48,Daten!A$44)))","v":""},{"$f":"IF(B28=0,\"\",IF(AB28=\"Standard\",IF(Daten!F$9=TRUE,1,0),0))","v":""},"",{"$f":"IF(B28=0,\"\",IF(OR(AB28=Daten!A$46,AB28=Daten!A$47,AB28=Daten!A$48),AI28+W28,\"-\"))","v":""},{"$f":"IF(B28=0,\"\",IF(AB28=Daten!A$45,\"-\",Daten!F$5))","v":""},{"$f":"IF(B28=0,\"\",IF(AB28=Daten!A$45,\"-\",Daten!F$4))","v":""},{"$f":"IF(B28=0,\"\",IF(AB28=Daten!A$45,\"-\",Daten!F$6))","v":""},{"$f":"IF(B28=0,\"\",IF(AB28=Daten!A$45,\"-\",Daten!F$2))","v":""},{"$f":"IF(B28=0,\"\",IF(AB28=Daten!A$45,\"-\",Daten!F$3))","v":""},"",{"$f":"IF(B28=0,\"\",IF(OR(C28=\"Nein\",Daten!D30=\"Ohne\"),\"-\",Daten!D$9))","v":""},{"$f":"IF(B28=0,\"\",IF(OR(C28=\"Nein\",Daten!D30=\"Ohne\"),\"-\",IF(Daten!D$8=\"Rahmendämmung\",Daten!D$10,\"-\")))","v":""},{"$f":"IF(B28=0,\"\",IF(AND(C28=\"Ja\",Daten!D$15=TRUE),Daten!D$16,\"-\"))","v":""},{"$f":"IF(AN28=\"\",\"\",IF(AND(C28=\"Ja\",Daten!D$15=TRUE),Daten!D$18,\"-\"))","v":""},{"$f":"IF(B28=0,\"\",IF(Daten!H$7=TRUE,\"bauseits\",IF(Daten!H$8=TRUE,\"FSP 40\",\"WSP 40\")))","v":""},{"$f":"IF(B28=0,\"\",Daten!H$10)","v":""},{"$f":"IFERROR(IF(B28=0,\"\",IF(Daten!H$2=TRUE,1,0)*IF(J28+P28+P28+Q28+Q28>Daten!B$62,0,1)*IF(K28+P28+Z28+AF28+10>Daten!B$62,0,1)),0)","v":""}]
[null,null,{"$f":"IF(A29=\"\",\"\",IF(Daten!D$1<>\"Keine\",\"Ja\",\"Nein\"))","v":""},{"$f":"IF(A29=\"\",\"\",IF(Daten!B$4=TRUE,\"QB\",\"BS\")&IF(AR29=1,\"G\",\"\")&IF(C29=\"Nein\",\"-V\",IF(Daten!D$11=TRUE,\"-S\",\"-H\"))&IF(Daten!B$1=TRUE,\"-E\",\"\")&IF(Daten!F$9=TRUE,\"-B\",\"\")&IF(Daten!F$8=TRUE,\"A\",\"\"))","v":""},{"$f":"IF(A29=\"\",\"\",IFERROR(VLOOKUP(D29,Daten!D$43:G$94,2,FALSE),\"spez.\"))","v":""},null,null,null,null,{"$f":"IF(F29<>\"\",F29+(2*(Daten!B$13+2)),IF(H29<>\"\",H29-10,\"\"))","v":""},{"$f":"IFERROR(IF(G29<>\"\",G29+Daten!B$14+Daten!B$15+2+IF(AG29=\"-\",0,AG29),IF(I29<>\"\",I29-5,\"\")),\"\")","v":""},{"$f":"IF(B29=0,\"\",IF(L$1=0,0,Daten!B$10))","v":""},{"$f":"IF(B29=0,\"\",IF(M$1=0,0,Daten!B$11))","v":""},{"$f":"IF(B29=0,\"\",IF(N$1=0,0,Daten!B$12))","v":""},"",{"$f":"IF(B29=0,\"\",Daten!B$6)","v":""},{"$f":"IF(B29=0,\"\",Daten!B$16)","v":""},{"$f":"IF(B29=0,\"\",IF(Daten!B$1=TRUE,Daten!B$17,\"-\"))","v":""},{"$f":"IF(B29=0,\"\",IF(C29=\"Nein\",\"-\",Daten!D$7))","v":""},{"$f":"IF(B29=\"\",\"\",IF(C29=\"Nein\",\"-\",IF(T$1=0,\"\",Daten!D$12)))","v":""},{"$f":"IF(B29=\"\",\"\",IF(C29=\"Nein\",\"-\",IF(T$1=0,\"\",Daten!D$13)))","v":""},{"$f":"IF(B29=\"\",\"\",IF(C29=\"Nein\",\"-\",IF(T$1=0,\"\",IF(AK29=\"\",\"\",AK29+X29-Daten!D$20))))","v":""},{"$f":"IF(B29=0,\"\",IF(L$1=1,M29+N29,Daten!D$2))","v":""},{"$f":"IF(B29=0,\"\",IF(C29=\"Nein\",\"-\",Daten!D$6))","v":""},{"$f":"IF(B29=0,\"\",IF(C29=\"Nein\",\"-\",Daten!D$3))","v":""},{"$f":"IF(B29=0,\"\",Daten!D$4)","v":""},{"$f":"IF(B29=0,\"\",IF(C29=\"Nein\",\"-\",Daten!D$5))","v":""},{"$f":"IF(B29=0,\"\",IF(Daten!F$1=\"Keine\",Daten!A$45,IF(Daten!F$7=TRUE,Daten!A$48,Daten!A$44)))","v":""},{"$f":"IF(B29=0,\"\",IF(AB29=\"Standard\",IF(Daten!F$9=TRUE,1,0),0))","v":""},"",{"$f":"IF(B29=0,\"\",IF(OR(AB29=Daten!A$46,AB29=Daten!A$47,AB29=Daten!A$48),AI29+W29,\"-\"))","v":""},{"$f":"IF(B29=0,\"\",IF(AB29=Daten!A$45,\"-\",Daten!F$5))","v":""},{"$f":"IF(B29=0,\"\",IF(AB29=Daten!A$45,\"-\",Daten!F$4))","v":""},{"$f":"IF(B29=0,\"\",IF(AB29=Daten!A$45,\"-\",Daten!F$6))","v":""},{"$f":"IF(B29=0,\"\",IF(AB29=Daten!A$45,\"-\",Daten!F$2))","v":""},{"$f":"IF(B29=0,\"\",IF(AB29=Daten!A$45,\"-\",Daten!F$3))","v":""},"",{"$f":"IF(B29=0,\"\",IF(OR(C29=\"Nein\",Daten!D31=\"Ohne\"),\"-\",Daten!D$9))","v":""},{"$f":"IF(B29=0,\"\",IF(OR(C29=\"Nein\",Daten!D31=\"Ohne\"),\"-\",IF(Daten!D$8=\"Rahmendämmung\",Daten!D$10,\"-\")))","v":""},{"$f":"IF(B29=0,\"\",IF(AND(C29=\"Ja\",Daten!D$15=TRUE),Daten!D$16,\"-\"))","v":""},{"$f":"IF(AN29=\"\",\"\",IF(AND(C29=\"Ja\",Daten!D$15=TRUE),Daten!D$18,\"-\"))","v":""},{"$f":"IF(B29=0,\"\",IF(Daten!H$7=TRUE,\"bauseits\",IF(Daten!H$8=TRUE,\"FSP 40\",\"WSP 40\")))","v":""},{"$f":"IF(B29=0,\"\",Daten!H$10)","v":""},{"$f":"IFERROR(IF(B29=0,\"\",IF(Daten!H$2=TRUE,1,0)*IF(J29+P29+P29+Q29+Q29>Daten!B$62,0,1)*IF(K29+P29+Z29+AF29+10>Daten!B$62,0,1)),0)","v":""}]
[null,null,{"$f":"IF(A30=\"\",\"\",IF(Daten!D$1<>\"Keine\",\"Ja\",\"Nein\"))","v":""},{"$f":"IF(A30=\"\",\"\",IF(Daten!B$4=TRUE,\"QB\",\"BS\")&IF(AR30=1,\"G\",\"\")&IF(C30=\"Nein\",\"-V\",IF(Daten!D$11=TRUE,\"-S\",\"-H\"))&IF(Daten!B$1=TRUE,\"-E\",\"\")&IF(Daten!F$9=TRUE,\"-B\",\"\")&IF(Daten!F$8=TRUE,\"A\",\"\"))","v":""},{"$f":"IF(A30=\"\",\"\",IFERROR(VLOOKUP(D30,Daten!D$43:G$94,2,FALSE),\"spez.\"))","v":""},null,null,null,null,{"$f":"IF(F30<>\"\",F30+(2*(Daten!B$13+2)),IF(H30<>\"\",H30-10,\"\"))","v":""},{"$f":"IFERROR(IF(G30<>\"\",G30+Daten!B$14+Daten!B$15+2+IF(AG30=\"-\",0,AG30),IF(I30<>\"\",I30-5,\"\")),\"\")","v":""},{"$f":"IF(B30=0,\"\",IF(L$1=0,0,Daten!B$10))","v":""},{"$f":"IF(B30=0,\"\",IF(M$1=0,0,Daten!B$11))","v":""},{"$f":"IF(B30=0,\"\",IF(N$1=0,0,Daten!B$12))","v":""},"",{"$f":"IF(B30=0,\"\",Daten!B$6)","v":""},{"$f":"IF(B30=0,\"\",Daten!B$16)","v":""},{"$f":"IF(B30=0,\"\",IF(Daten!B$1=TRUE,Daten!B$17,\"-\"))","v":""},{"$f":"IF(B30=0,\"\",IF(C30=\"Nein\",\"-\",Daten!D$7))","v":""},{"$f":"IF(B30=\"\",\"\",IF(C30=\"Nein\",\"-\",IF(T$1=0,\"\",Daten!D$12)))","v":""},{"$f":"IF(B30=\"\",\"\",IF(C30=\"Nein\",\"-\",IF(T$1=0,\"\",Daten!D$13)))","v":""},{"$f":"IF(B30=\"\",\"\",IF(C30=\"Nein\",\"-\",IF(T$1=0,\"\",IF(AK30=\"\",\"\",AK30+X30-Daten!D$20))))","v":""},{"$f":"IF(B30=0,\"\",IF(L$1=1,M30+N30,Daten!D$2))","v":""},{"$f":"IF(B30=0,\"\",IF(C30=\"Nein\",\"-\",Daten!D$6))","v":""},{"$f":"IF(B30=0,\"\",IF(C30=\"Nein\",\"-\",Daten!D$3))","v":""},{"$f":"IF(B30=0,\"\",Daten!D$4)","v":""},{"$f":"IF(B30=0,\"\",IF(C30=\"Nein\",\"-\",Daten!D$5))","v":""},{"$f":"IF(B30=0,\"\",IF(Daten!F$1=\"Keine\",Daten!A$45,IF(Daten!F$7=TRUE,Daten!A$48,Daten!A$44)))","v":""},{"$f":"IF(B30=0,\"\",IF(AB30=\"Standard\",IF(Daten!F$9=TRUE,1,0),0))","v":""},"",{"$f":"IF(B30=0,\"\",IF(OR(AB30=Daten!A$46,AB30=Daten!A$47,AB30=Daten!A$48),AI30+W30,\"-\"))","v":""},{"$f":"IF(B30=0,\"\",IF(AB30=Daten!A$45,\"-\",Daten!F$5))","v":""},{"$f":"IF(B30=0,\"\",IF(AB30=Daten!A$45,\"-\",Daten!F$4))","v":""},{"$f":"IF(B30=0,\"\",IF(AB30=Daten!A$45,\"-\",Daten!F$6))","v":""},{"$f":"IF(B30=0,\"\",IF(AB30=Daten!A$45,\"-\",Daten!F$2))","v":""},{"$f":"IF(B30=0,\"\",IF(AB30=Daten!A$45,\"-\",Daten!F$3))","v":""},"",{"$f":"IF(B30=0,\"\",IF(OR(C30=\"Nein\",Daten!D32=\"Ohne\"),\"-\",Daten!D$9))","v":""},{"$f":"IF(B30=0,\"\",IF(OR(C30=\"Nein\",Daten!D32=\"Ohne\"),\"-\",IF(Daten!D$8=\"Rahmendämmung\",Daten!D$10,\"-\")))","v":""},{"$f":"IF(B30=0,\"\",IF(AND(C30=\"Ja\",Daten!D$15=TRUE),Daten!D$16,\"-\"))","v":""},{"$f":"IF(AN30=\"\",\"\",IF(AND(C30=\"Ja\",Daten!D$15=TRUE),Daten!D$18,\"-\"))","v":""},{"$f":"IF(B30=0,\"\",IF(Daten!H$7=TRUE,\"bauseits\",IF(Daten!H$8=TRUE,\"FSP 40\",\"WSP 40\")))","v":""},{"$f":"IF(B30=0,\"\",Daten!H$10)","v":""},{"$f":"IFERROR(IF(B30=0,\"\",IF(Daten!H$2=TRUE,1,0)*IF(J30+P30+P30+Q30+Q30>Daten!B$62,0,1)*IF(K30+P30+Z30+AF30+10>Daten!B$62,0,1)),0)","v":""}]
[null,null,{"$f":"IF(A31=\"\",\"\",IF(Daten!D$1<>\"Keine\",\"Ja\",\"Nein\"))","v":""},{"$f":"IF(A31=\"\",\"\",IF(Daten!B$4=TRUE,\"QB\",\"BS\")&IF(AR31=1,\"G\",\"\")&IF(C31=\"Nein\",\"-V\",IF(Daten!D$11=TRUE,\"-S\",\"-H\"))&IF(Daten!B$1=TRUE,\"-E\",\"\")&IF(Daten!F$9=TRUE,\"-B\",\"\")&IF(Daten!F$8=TRUE,\"A\",\"\"))","v":""},{"$f":"IF(A31=\"\",\"\",IFERROR(VLOOKUP(D31,Daten!D$43:G$94,2,FALSE),\"spez.\"))","v":""},null,null,null,null,{"$f":"IF(F31<>\"\",F31+(2*(Daten!B$13+2)),IF(H31<>\"\",H31-10,\"\"))","v":""},{"$f":"IFERROR(IF(G31<>\"\",G31+Daten!B$14+Daten!B$15+2+IF(AG31=\"-\",0,AG31),IF(I31<>\"\",I31-5,\"\")),\"\")","v":""},{"$f":"IF(B31=0,\"\",IF(L$1=0,0,Daten!B$10))","v":""},{"$f":"IF(B31=0,\"\",IF(M$1=0,0,Daten!B$11))","v":""},{"$f":"IF(B31=0,\"\",IF(N$1=0,0,Daten!B$12))","v":""},"",{"$f":"IF(B31=0,\"\",Daten!B$6)","v":""},{"$f":"IF(B31=0,\"\",Daten!B$16)","v":""},{"$f":"IF(B31=0,\"\",IF(Daten!B$1=TRUE,Daten!B$17,\"-\"))","v":""},{"$f":"IF(B31=0,\"\",IF(C31=\"Nein\",\"-\",Daten!D$7))","v":""},{"$f":"IF(B31=\"\",\"\",IF(C31=\"Nein\",\"-\",IF(T$1=0,\"\",Daten!D$12)))","v":""},{"$f":"IF(B31=\"\",\"\",IF(C31=\"Nein\",\"-\",IF(T$1=0,\"\",Daten!D$13)))","v":""},{"$f":"IF(B31=\"\",\"\",IF(C31=\"Nein\",\"-\",IF(T$1=0,\"\",IF(AK31=\"\",\"\",AK31+X31-Daten!D$20))))","v":""},{"$f":"IF(B31=0,\"\",IF(L$1=1,M31+N31,Daten!D$2))","v":""},{"$f":"IF(B31=0,\"\",IF(C31=\"Nein\",\"-\",Daten!D$6))","v":""},{"$f":"IF(B31=0,\"\",IF(C31=\"Nein\",\"-\",Daten!D$3))","v":""},{"$f":"IF(B31=0,\"\",Daten!D$4)","v":""},{"$f":"IF(B31=0,\"\",IF(C31=\"Nein\",\"-\",Daten!D$5))","v":""},{"$f":"IF(B31=0,\"\",IF(Daten!F$1=\"Keine\",Daten!A$45,IF(Daten!F$7=TRUE,Daten!A$48,Daten!A$44)))","v":""},{"$f":"IF(B31=0,\"\",IF(AB31=\"Standard\",IF(Daten!F$9=TRUE,1,0),0))","v":""},"",{"$f":"IF(B31=0,\"\",IF(OR(AB31=Daten!A$46,AB31=Daten!A$47,AB31=Daten!A$48),AI31+W31,\"-\"))","v":""},{"$f":"IF(B31=0,\"\",IF(AB31=Daten!A$45,\"-\",Daten!F$5))","v":""},{"$f":"IF(B31=0,\"\",IF(AB31=Daten!A$45,\"-\",Daten!F$4))","v":""},{"$f":"IF(B31=0,\"\",IF(AB31=Daten!A$45,\"-\",Daten!F$6))","v":""},{"$f":"IF(B31=0,\"\",IF(AB31=Daten!A$45,\"-\",Daten!F$2))","v":""},{"$f":"IF(B31=0,\"\",IF(AB31=Daten!A$45,\"-\",Daten!F$3))","v":""},"",{"$f":"IF(B31=0,\"\",IF(OR(C31=\"Nein\",Daten!D33=\"Ohne\"),\"-\",Daten!D$9))","v":""},{"$f":"IF(B31=0,\"\",IF(OR(C31=\"Nein\",Daten!D33=\"Ohne\"),\"-\",IF(Daten!D$8=\"Rahmendämmung\",Daten!D$10,\"-\")))","v":""},{"$f":"IF(B31=0,\"\",IF(AND(C31=\"Ja\",Daten!D$15=TRUE),Daten!D$16,\"-\"))","v":""},{"$f":"IF(AN31=\"\",\"\",IF(AND(C31=\"Ja\",Daten!D$15=TRUE),Daten!D$18,\"-\"))","v":""},{"$f":"IF(B31=0,\"\",IF(Daten!H$7=TRUE,\"bauseits\",IF(Daten!H$8=TRUE,\"FSP 40\",\"WSP 40\")))","v":""},{"$f":"IF(B31=0,\"\",Daten!H$10)","v":""},{"$f":"IFERROR(IF(B31=0,\"\",IF(Daten!H$2=TRUE,1,0)*IF(J31+P31+P31+Q31+Q31>Daten!B$62,0,1)*IF(K31+P31+Z31+AF31+10>Daten!B$62,0,1)),0)","v":""}]
[null,null,{"$f":"IF(A32=\"\",\"\",IF(Daten!D$1<>\"Keine\",\"Ja\",\"Nein\"))","v":""},{"$f":"IF(A32=\"\",\"\",IF(Daten!B$4=TRUE,\"QB\",\"BS\")&IF(AR32=1,\"G\",\"\")&IF(C32=\"Nein\",\"-V\",IF(Daten!D$11=TRUE,\"-S\",\"-H\"))&IF(Daten!B$1=TRUE,\"-E\",\"\")&IF(Daten!F$9=TRUE,\"-B\",\"\")&IF(Daten!F$8=TRUE,\"A\",\"\"))","v":""},{"$f":"IF(A32=\"\",\"\",IFERROR(VLOOKUP(D32,Daten!D$43:G$94,2,FALSE),\"spez.\"))","v":""},null,null,null,null,{"$f":"IF(F32<>\"\",F32+(2*(Daten!B$13+2)),IF(H32<>\"\",H32-10,\"\"))","v":""},{"$f":"IFERROR(IF(G32<>\"\",G32+Daten!B$14+Daten!B$15+2+IF(AG32=\"-\",0,AG32),IF(I32<>\"\",I32-5,\"\")),\"\")","v":""},{"$f":"IF(B32=0,\"\",IF(L$1=0,0,Daten!B$10))","v":""},{"$f":"IF(B32=0,\"\",IF(M$1=0,0,Daten!B$11))","v":""},{"$f":"IF(B32=0,\"\",IF(N$1=0,0,Daten!B$12))","v":""},"",{"$f":"IF(B32=0,\"\",Daten!B$6)","v":""},{"$f":"IF(B32=0,\"\",Daten!B$16)","v":""},{"$f":"IF(B32=0,\"\",IF(Daten!B$1=TRUE,Daten!B$17,\"-\"))","v":""},{"$f":"IF(B32=0,\"\",IF(C32=\"Nein\",\"-\",Daten!D$7))","v":""},{"$f":"IF(B32=\"\",\"\",IF(C32=\"Nein\",\"-\",IF(T$1=0,\"\",Daten!D$12)))","v":""},{"$f":"IF(B32=\"\",\"\",IF(C32=\"Nein\",\"-\",IF(T$1=0,\"\",Daten!D$13)))","v":""},{"$f":"IF(B32=\"\",\"\",IF(C32=\"Nein\",\"-\",IF(T$1=0,\"\",IF(AK32=\"\",\"\",AK32+X32-Daten!D$20))))","v":""},{"$f":"IF(B32=0,\"\",IF(L$1=1,M32+N32,Daten!D$2))","v":""},{"$f":"IF(B32=0,\"\",IF(C32=\"Nein\",\"-\",Daten!D$6))","v":""},{"$f":"IF(B32=0,\"\",IF(C32=\"Nein\",\"-\",Daten!D$3))","v":""},{"$f":"IF(B32=0,\"\",Daten!D$4)","v":""},{"$f":"IF(B32=0,\"\",IF(C32=\"Nein\",\"-\",Daten!D$5))","v":""},{"$f":"IF(B32=0,\"\",IF(Daten!F$1=\"Keine\",Daten!A$45,IF(Daten!F$7=TRUE,Daten!A$48,Daten!A$44)))","v":""},{"$f":"IF(B32=0,\"\",IF(AB32=\"Standard\",IF(Daten!F$9=TRUE,1,0),0))","v":""},"",{"$f":"IF(B32=0,\"\",IF(OR(AB32=Daten!A$46,AB32=Daten!A$47,AB32=Daten!A$48),AI32+W32,\"-\"))","v":""},{"$f":"IF(B32=0,\"\",IF(AB32=Daten!A$45,\"-\",Daten!F$5))","v":""},{"$f":"IF(B32=0,\"\",IF(AB32=Daten!A$45,\"-\",Daten!F$4))","v":""},{"$f":"IF(B32=0,\"\",IF(AB32=Daten!A$45,\"-\",Daten!F$6))","v":""},{"$f":"IF(B32=0,\"\",IF(AB32=Daten!A$45,\"-\",Daten!F$2))","v":""},{"$f":"IF(B32=0,\"\",IF(AB32=Daten!A$45,\"-\",Daten!F$3))","v":""},"",{"$f":"IF(B32=0,\"\",IF(OR(C32=\"Nein\",Daten!D34=\"Ohne\"),\"-\",Daten!D$9))","v":""},{"$f":"IF(B32=0,\"\",IF(OR(C32=\"Nein\",Daten!D34=\"Ohne\"),\"-\",IF(Daten!D$8=\"Rahmendämmung\",Daten!D$10,\"-\")))","v":""},{"$f":"IF(B32=0,\"\",IF(AND(C32=\"Ja\",Daten!D$15=TRUE),Daten!D$16,\"-\"))","v":""},{"$f":"IF(AN32=\"\",\"\",IF(AND(C32=\"Ja\",Daten!D$15=TRUE),Daten!D$18,\"-\"))","v":""},{"$f":"IF(B32=0,\"\",IF(Daten!H$7=TRUE,\"bauseits\",IF(Daten!H$8=TRUE,\"FSP 40\",\"WSP 40\")))","v":""},{"$f":"IF(B32=0,\"\",Daten!H$10)","v":""},{"$f":"IFERROR(IF(B32=0,\"\",IF(Daten!H$2=TRUE,1,0)*IF(J32+P32+P32+Q32+Q32>Daten!B$62,0,1)*IF(K32+P32+Z32+AF32+10>Daten!B$62,0,1)),0)","v":""}]
[null,null,{"$f":"IF(A33=\"\",\"\",IF(Daten!D$1<>\"Keine\",\"Ja\",\"Nein\"))","v":""},{"$f":"IF(A33=\"\",\"\",IF(Daten!B$4=TRUE,\"QB\",\"BS\")&IF(AR33=1,\"G\",\"\")&IF(C33=\"Nein\",\"-V\",IF(Daten!D$11=TRUE,\"-S\",\"-H\"))&IF(Daten!B$1=TRUE,\"-E\",\"\")&IF(Daten!F$9=TRUE,\"-B\",\"\")&IF(Daten!F$8=TRUE,\"A\",\"\"))","v":""},{"$f":"IF(A33=\"\",\"\",IFERROR(VLOOKUP(D33,Daten!D$43:G$94,2,FALSE),\"spez.\"))","v":""},null,null,null,null,{"$f":"IF(F33<>\"\",F33+(2*(Daten!B$13+2)),IF(H33<>\"\",H33-10,\"\"))","v":""},{"$f":"IFERROR(IF(G33<>\"\",G33+Daten!B$14+Daten!B$15+2+IF(AG33=\"-\",0,AG33),IF(I33<>\"\",I33-5,\"\")),\"\")","v":""},{"$f":"IF(B33=0,\"\",IF(L$1=0,0,Daten!B$10))","v":""},{"$f":"IF(B33=0,\"\",IF(M$1=0,0,Daten!B$11))","v":""},{"$f":"IF(B33=0,\"\",IF(N$1=0,0,Daten!B$12))","v":""},"",{"$f":"IF(B33=0,\"\",Daten!B$6)","v":""},{"$f":"IF(B33=0,\"\",Daten!B$16)","v":""},{"$f":"IF(B33=0,\"\",IF(Daten!B$1=TRUE,Daten!B$17,\"-\"))","v":""},{"$f":"IF(B33=0,\"\",IF(C33=\"Nein\",\"-\",Daten!D$7))","v":""},{"$f":"IF(B33=\"\",\"\",IF(C33=\"Nein\",\"-\",IF(T$1=0,\"\",Daten!D$12)))","v":""},{"$f":"IF(B33=\"\",\"\",IF(C33=\"Nein\",\"-\",IF(T$1=0,\"\",Daten!D$13)))","v":""},{"$f":"IF(B33=\"\",\"\",IF(C33=\"Nein\",\"-\",IF(T$1=0,\"\",IF(AK33=\"\",\"\",AK33+X33-Daten!D$20))))","v":""},{"$f":"IF(B33=0,\"\",IF(L$1=1,M33+N33,Daten!D$2))","v":""},{"$f":"IF(B33=0,\"\",IF(C33=\"Nein\",\"-\",Daten!D$6))","v":""},{"$f":"IF(B33=0,\"\",IF(C33=\"Nein\",\"-\",Daten!D$3))","v":""},{"$f":"IF(B33=0,\"\",Daten!D$4)","v":""},{"$f":"IF(B33=0,\"\",IF(C33=\"Nein\",\"-\",Daten!D$5))","v":""},{"$f":"IF(B33=0,\"\",IF(Daten!F$1=\"Keine\",Daten!A$45,IF(Daten!F$7=TRUE,Daten!A$48,Daten!A$44)))","v":""},{"$f":"IF(B33=0,\"\",IF(AB33=\"Standard\",IF(Daten!F$9=TRUE,1,0),0))","v":""},"",{"$f":"IF(B33=0,\"\",IF(OR(AB33=Daten!A$46,AB33=Daten!A$47,AB33=Daten!A$48),AI33+W33,\"-\"))","v":""},{"$f":"IF(B33=0,\"\",IF(AB33=Daten!A$45,\"-\",Daten!F$5))","v":""},{"$f":"IF(B33=0,\"\",IF(AB33=Daten!A$45,\"-\",Daten!F$4))","v":""},{"$f":"IF(B33=0,\"\",IF(AB33=Daten!A$45,\"-\",Daten!F$6))","v":""},{"$f":"IF(B33=0,\"\",IF(AB33=Daten!A$45,\"-\",Daten!F$2))","v":""},{"$f":"IF(B33=0,\"\",IF(AB33=Daten!A$45,\"-\",Daten!F$3))","v":""},"",{"$f":"IF(B33=0,\"\",IF(OR(C33=\"Nein\",Daten!D35=\"Ohne\"),\"-\",Daten!D$9))","v":""},{"$f":"IF(B33=0,\"\",IF(OR(C33=\"Nein\",Daten!D35=\"Ohne\"),\"-\",IF(Daten!D$8=\"Rahmendämmung\",Daten!D$10,\"-\")))","v":""},{"$f":"IF(B33=0,\"\",IF(AND(C33=\"Ja\",Daten!D$15=TRUE),Daten!D$16,\"-\"))","v":""},{"$f":"IF(AN33=\"\",\"\",IF(AND(C33=\"Ja\",Daten!D$15=TRUE),Daten!D$18,\"-\"))","v":""},{"$f":"IF(B33=0,\"\",IF(Daten!H$7=TRUE,\"bauseits\",IF(Daten!H$8=TRUE,\"FSP 40\",\"WSP 40\")))","v":""},{"$f":"IF(B33=0,\"\",Daten!H$10)","v":""},{"$f":"IFERROR(IF(B33=0,\"\",IF(Daten!H$2=TRUE,1,0)*IF(J33+P33+P33+Q33+Q33>Daten!B$62,0,1)*IF(K33+P33+Z33+AF33+10>Daten!B$62,0,1)),0)","v":""}]
[null,null,{"$f":"IF(A34=\"\",\"\",IF(Daten!D$1<>\"Keine\",\"Ja\",\"Nein\"))","v":""},{"$f":"IF(A34=\"\",\"\",IF(Daten!B$4=TRUE,\"QB\",\"BS\")&IF(AR34=1,\"G\",\"\")&IF(C34=\"Nein\",\"-V\",IF(Daten!D$11=TRUE,\"-S\",\"-H\"))&IF(Daten!B$1=TRUE,\"-E\",\"\")&IF(Daten!F$9=TRUE,\"-B\",\"\")&IF(Daten!F$8=TRUE,\"A\",\"\"))","v":""},{"$f":"IF(A34=\"\",\"\",IFERROR(VLOOKUP(D34,Daten!D$43:G$94,2,FALSE),\"spez.\"))","v":""},null,null,null,null,{"$f":"IF(F34<>\"\",F34+(2*(Daten!B$13+2)),IF(H34<>\"\",H34-10,\"\"))","v":""},{"$f":"IFERROR(IF(G34<>\"\",G34+Daten!B$14+Daten!B$15+2+IF(AG34=\"-\",0,AG34),IF(I34<>\"\",I34-5,\"\")),\"\")","v":""},{"$f":"IF(B34=0,\"\",IF(L$1=0,0,Daten!B$10))","v":""},{"$f":"IF(B34=0,\"\",IF(M$1=0,0,Daten!B$11))","v":""},{"$f":"IF(B34=0,\"\",IF(N$1=0,0,Daten!B$12))","v":""},"",{"$f":"IF(B34=0,\"\",Daten!B$6)","v":""},{"$f":"IF(B34=0,\"\",Daten!B$16)","v":""},{"$f":"IF(B34=0,\"\",IF(Daten!B$1=TRUE,Daten!B$17,\"-\"))","v":""},{"$f":"IF(B34=0,\"\",IF(C34=\"Nein\",\"-\",Daten!D$7))","v":""},{"$f":"IF(B34=\"\",\"\",IF(C34=\"Nein\",\"-\",IF(T$1=0,\"\",Daten!D$12)))","v":""},{"$f":"IF(B34=\"\",\"\",IF(C34=\"Nein\",\"-\",IF(T$1=0,\"\",Daten!D$13)))","v":""},{"$f":"IF(B34=\"\",\"\",IF(C34=\"Nein\",\"-\",IF(T$1=0,\"\",IF(AK34=\"\",\"\",AK34+X34-Daten!D$20))))","v":""},{"$f":"IF(B34=0,\"\",IF(L$1=1,M34+N34,Daten!D$2))","v":""},{"$f":"IF(B34=0,\"\",IF(C34=\"Nein\",\"-\",Daten!D$6))","v":""},{"$f":"IF(B34=0,\"\",IF(C34=\"Nein\",\"-\",Daten!D$3))","v":""},{"$f":"IF(B34=0,\"\",Daten!D$4)","v":""},{"$f":"IF(B34=0,\"\",IF(C34=\"Nein\",\"-\",Daten!D$5))","v":""},{"$f":"IF(B34=0,\"\",IF(Daten!F$1=\"Keine\",Daten!A$45,IF(Daten!F$7=TRUE,Daten!A$48,Daten!A$44)))","v":""},{"$f":"IF(B34=0,\"\",IF(AB34=\"Standard\",IF(Daten!F$9=TRUE,1,0),0))","v":""},"",{"$f":"IF(B34=0,\"\",IF(OR(AB34=Daten!A$46,AB34=Daten!A$47,AB34=Daten!A$48),AI34+W34,\"-\"))","v":""},{"$f":"IF(B34=0,\"\",IF(AB34=Daten!A$45,\"-\",Daten!F$5))","v":""},{"$f":"IF(B34=0,\"\",IF(AB34=Daten!A$45,\"-\",Daten!F$4))","v":""},{"$f":"IF(B34=0,\"\",IF(AB34=Daten!A$45,\"-\",Daten!F$6))","v":""},{"$f":"IF(B34=0,\"\",IF(AB34=Daten!A$45,\"-\",Daten!F$2))","v":""},{"$f":"IF(B34=0,\"\",IF(AB34=Daten!A$45,\"-\",Daten!F$3))","v":""},"",{"$f":"IF(B34=0,\"\",IF(OR(C34=\"Nein\",Daten!D36=\"Ohne\"),\"-\",Daten!D$9))","v":""},{"$f":"IF(B34=0,\"\",IF(OR(C34=\"Nein\",Daten!D36=\"Ohne\"),\"-\",IF(Daten!D$8=\"Rahmendämmung\",Daten!D$10,\"-\")))","v":""},{"$f":"IF(B34=0,\"\",IF(AND(C34=\"Ja\",Daten!D$15=TRUE),Daten!D$16,\"-\"))","v":""},{"$f":"IF(AN34=\"\",\"\",IF(AND(C34=\"Ja\",Daten!D$15=TRUE),Daten!D$18,\"-\"))","v":""},{"$f":"IF(B34=0,\"\",IF(Daten!H$7=TRUE,\"bauseits\",IF(Daten!H$8=TRUE,\"FSP 40\",\"WSP 40\")))","v":""},{"$f":"IF(B34=0,\"\",Daten!H$10)","v":""},{"$f":"IFERROR(IF(B34=0,\"\",IF(Daten!H$2=TRUE,1,0)*IF(J34+P34+P34+Q34+Q34>Daten!B$62,0,1)*IF(K34+P34+Z34+AF34+10>Daten!B$62,0,1)),0)","v":""}]
[null,null,{"$f":"IF(A35=\"\",\"\",IF(Daten!D$1<>\"Keine\",\"Ja\",\"Nein\"))","v":""},{"$f":"IF(A35=\"\",\"\",IF(Daten!B$4=TRUE,\"QB\",\"BS\")&IF(AR35=1,\"G\",\"\")&IF(C35=\"Nein\",\"-V\",IF(Daten!D$11=TRUE,\"-S\",\"-H\"))&IF(Daten!B$1=TRUE,\"-E\",\"\")&IF(Daten!F$9=TRUE,\"-B\",\"\")&IF(Daten!F$8=TRUE,\"A\",\"\"))","v":""},{"$f":"IF(A35=\"\",\"\",IFERROR(VLOOKUP(D35,Daten!D$43:G$94,2,FALSE),\"spez.\"))","v":""},null,null,null,null,{"$f":"IF(F35<>\"\",F35+(2*(Daten!B$13+2)),IF(H35<>\"\",H35-10,\"\"))","v":""},{"$f":"IFERROR(IF(G35<>\"\",G35+Daten!B$14+Daten!B$15+2+IF(AG35=\"-\",0,AG35),IF(I35<>\"\",I35-5,\"\")),\"\")","v":""},{"$f":"IF(B35=0,\"\",IF(L$1=0,0,Daten!B$10))","v":""},{"$f":"IF(B35=0,\"\",IF(M$1=0,0,Daten!B$11))","v":""},{"$f":"IF(B35=0,\"\",IF(N$1=0,0,Daten!B$12))","v":""},"",{"$f":"IF(B35=0,\"\",Daten!B$6)","v":""},{"$f":"IF(B35=0,\"\",Daten!B$16)","v":""},{"$f":"IF(B35=0,\"\",IF(Daten!B$1=TRUE,Daten!B$17,\"-\"))","v":""},{"$f":"IF(B35=0,\"\",IF(C35=\"Nein\",\"-\",Daten!D$7))","v":""},{"$f":"IF(B35=\"\",\"\",IF(C35=\"Nein\",\"-\",IF(T$1=0,\"\",Daten!D$12)))","v":""},{"$f":"IF(B35=\"\",\"\",IF(C35=\"Nein\",\"-\",IF(T$1=0,\"\",Daten!D$13)))","v":""},{"$f":"IF(B35=\"\",\"\",IF(C35=\"Nein\",\"-\",IF(T$1=0,\"\",IF(AK35=\"\",\"\",AK35+X35-Daten!D$20))))","v":""},{"$f":"IF(B35=0,\"\",IF(L$1=1,M35+N35,Daten!D$2))","v":""},{"$f":"IF(B35=0,\"\",IF(C35=\"Nein\",\"-\",Daten!D$6))","v":""},{"$f":"IF(B35=0,\"\",IF(C35=\"Nein\",\"-\",Daten!D$3))","v":""},{"$f":"IF(B35=0,\"\",Daten!D$4)","v":""},{"$f":"IF(B35=0,\"\",IF(C35=\"Nein\",\"-\",Daten!D$5))","v":""},{"$f":"IF(B35=0,\"\",IF(Daten!F$1=\"Keine\",Daten!A$45,IF(Daten!F$7=TRUE,Daten!A$48,Daten!A$44)))","v":""},{"$f":"IF(B35=0,\"\",IF(AB35=\"Standard\",IF(Daten!F$9=TRUE,1,0),0))","v":""},"",{"$f":"IF(B35=0,\"\",IF(OR(AB35=Daten!A$46,AB35=Daten!A$47,AB35=Daten!A$48),AI35+W35,\"-\"))","v":""},{"$f":"IF(B35=0,\"\",IF(AB35=Daten!A$45,\"-\",Daten!F$5))","v":""},{"$f":"IF(B35=0,\"\",IF(AB35=Daten!A$45,\"-\",Daten!F$4))","v":""},{"$f":"IF(B35=0,\"\",IF(AB35=Daten!A$45,\"-\",Daten!F$6))","v":""},{"$f":"IF(B35=0,\"\",IF(AB35=Daten!A$45,\"-\",Daten!F$2))","v":""},{"$f":"IF(B35=0,\"\",IF(AB35=Daten!A$45,\"-\",Daten!F$3))","v":""},"",{"$f":"IF(B35=0,\"\",IF(OR(C35=\"Nein\",Daten!D37=\"Ohne\"),\"-\",Daten!D$9))","v":""},{"$f":"IF(B35=0,\"\",IF(OR(C35=\"Nein\",Daten!D37=\"Ohne\"),\"-\",IF(Daten!D$8=\"Rahmendämmung\",Daten!D$10,\"-\")))","v":""},{"$f":"IF(B35=0,\"\",IF(AND(C35=\"Ja\",Daten!D$15=TRUE),Daten!D$16,\"-\"))","v":""},{"$f":"IF(AN35=\"\",\"\",IF(AND(C35=\"Ja\",Daten!D$15=TRUE),Daten!D$18,\"-\"))","v":""},{"$f":"IF(B35=0,\"\",IF(Daten!H$7=TRUE,\"bauseits\",IF(Daten!H$8=TRUE,\"FSP 40\",\"WSP 40\")))","v":""},{"$f":"IF(B35=0,\"\",Daten!H$10)","v":""},{"$f":"IFERROR(IF(B35=0,\"\",IF(Daten!H$2=TRUE,1,0)*IF(J35+P35+P35+Q35+Q35>Daten!B$62,0,1)*IF(K35+P35+Z35+AF35+10>Daten!B$62,0,1)),0)","v":""}]
[null,null,{"$f":"IF(A36=\"\",\"\",IF(Daten!D$1<>\"Keine\",\"Ja\",\"Nein\"))","v":""},{"$f":"IF(A36=\"\",\"\",IF(Daten!B$4=TRUE,\"QB\",\"BS\")&IF(AR36=1,\"G\",\"\")&IF(C36=\"Nein\",\"-V\",IF(Daten!D$11=TRUE,\"-S\",\"-H\"))&IF(Daten!B$1=TRUE,\"-E\",\"\")&IF(Daten!F$9=TRUE,\"-B\",\"\")&IF(Daten!F$8=TRUE,\"A\",\"\"))","v":""},{"$f":"IF(A36=\"\",\"\",IFERROR(VLOOKUP(D36,Daten!D$43:G$94,2,FALSE),\"spez.\"))","v":""},null,null,null,null,{"$f":"IF(F36<>\"\",F36+(2*(Daten!B$13+2)),IF(H36<>\"\",H36-10,\"\"))","v":""},{"$f":"IFERROR(IF(G36<>\"\",G36+Daten!B$14+Daten!B$15+2+IF(AG36=\"-\",0,AG36),IF(I36<>\"\",I36-5,\"\")),\"\")","v":""},{"$f":"IF(B36=0,\"\",IF(L$1=0,0,Daten!B$10))","v":""},{"$f":"IF(B36=0,\"\",IF(M$1=0,0,Daten!B$11))","v":""},{"$f":"IF(B36=0,\"\",IF(N$1=0,0,Daten!B$12))","v":""},"",{"$f":"IF(B36=0,\"\",Daten!B$6)","v":""},{"$f":"IF(B36=0,\"\",Daten!B$16)","v":""},{"$f":"IF(B36=0,\"\",IF(Daten!B$1=TRUE,Daten!B$17,\"-\"))","v":""},{"$f":"IF(B36=0,\"\",IF(C36=\"Nein\",\"-\",Daten!D$7))","v":""},{"$f":"IF(B36=\"\",\"\",IF(C36=\"Nein\",\"-\",IF(T$1=0,\"\",Daten!D$12)))","v":""},{"$f":"IF(B36=\"\",\"\",IF(C36=\"Nein\",\"-\",IF(T$1=0,\"\",Daten!D$13)))","v":""},{"$f":"IF(B36=\"\",\"\",IF(C36=\"Nein\",\"-\",IF(T$1=0,\"\",IF(AK36=\"\",\"\",AK36+X36-Daten!D$20))))","v":""},{"$f":"IF(B36=0,\"\",IF(L$1=1,M36+N36,Daten!D$2))","v":""},{"$f":"IF(B36=0,\"\",IF(C36=\"Nein\",\"-\",Daten!D$6))","v":""},{"$f":"IF(B36=0,\"\",IF(C36=\"Nein\",\"-\",Daten!D$3))","v":""},{"$f":"IF(B36=0,\"\",Daten!D$4)","v":""},{"$f":"IF(B36=0,\"\",IF(C36=\"Nein\",\"-\",Daten!D$5))","v":""},{"$f":"IF(B36=0,\"\",IF(Daten!F$1=\"Keine\",Daten!A$45,IF(Daten!F$7=TRUE,Daten!A$48,Daten!A$44)))","v":""},{"$f":"IF(B36=0,\"\",IF(AB36=\"Standard\",IF(Daten!F$9=TRUE,1,0),0))","v":""},"",{"$f":"IF(B36=0,\"\",IF(OR(AB36=Daten!A$46,AB36=Daten!A$47,AB36=Daten!A$48),AI36+W36,\"-\"))","v":""},{"$f":"IF(B36=0,\"\",IF(AB36=Daten!A$45,\"-\",Daten!F$5))","v":""},{"$f":"IF(B36=0,\"\",IF(AB36=Daten!A$45,\"-\",Daten!F$4))","v":""},{"$f":"IF(B36=0,\"\",IF(AB36=Daten!A$45,\"-\",Daten!F$6))","v":""},{"$f":"IF(B36=0,\"\",IF(AB36=Daten!A$45,\"-\",Daten!F$2))","v":""},{"$f":"IF(B36=0,\"\",IF(AB36=Daten!A$45,\"-\",Daten!F$3))","v":""},"",{"$f":"IF(B36=0,\"\",IF(OR(C36=\"Nein\",Daten!D38=\"Ohne\"),\"-\",Daten!D$9))","v":""},{"$f":"IF(B36=0,\"\",IF(OR(C36=\"Nein\",Daten!D38=\"Ohne\"),\"-\",IF(Daten!D$8=\"Rahmendämmung\",Daten!D$10,\"-\")))","v":""},{"$f":"IF(B36=0,\"\",IF(AND(C36=\"Ja\",Daten!D$15=TRUE),Daten!D$16,\"-\"))","v":""},{"$f":"IF(AN36=\"\",\"\",IF(AND(C36=\"Ja\",Daten!D$15=TRUE),Daten!D$18,\"-\"))","v":""},{"$f":"IF(B36=0,\"\",IF(Daten!H$7=TRUE,\"bauseits\",IF(Daten!H$8=TRUE,\"FSP 40\",\"WSP 40\")))","v":""},{"$f":"IF(B36=0,\"\",Daten!H$10)","v":""},{"$f":"IFERROR(IF(B36=0,\"\",IF(Daten!H$2=TRUE,1,0)*IF(J36+P36+P36+Q36+Q36>Daten!B$62,0,1)*IF(K36+P36+Z36+AF36+10>Daten!B$62,0,1)),0)","v":""}]
[null,null,{"$f":"IF(A37=\"\",\"\",IF(Daten!D$1<>\"Keine\",\"Ja\",\"Nein\"))","v":""},{"$f":"IF(A37=\"\",\"\",IF(Daten!B$4=TRUE,\"QB\",\"BS\")&IF(AR37=1,\"G\",\"\")&IF(C37=\"Nein\",\"-V\",IF(Daten!D$11=TRUE,\"-S\",\"-H\"))&IF(Daten!B$1=TRUE,\"-E\",\"\")&IF(Daten!F$9=TRUE,\"-B\",\"\")&IF(Daten!F$8=TRUE,\"A\",\"\"))","v":""},{"$f":"IF(A37=\"\",\"\",IFERROR(VLOOKUP(D37,Daten!D$43:G$94,2,FALSE),\"spez.\"))","v":""},null,null,null,null,{"$f":"IF(F37<>\"\",F37+(2*(Daten!B$13+2)),IF(H37<>\"\",H37-10,\"\"))","v":""},{"$f":"IFERROR(IF(G37<>\"\",G37+Daten!B$14+Daten!B$15+2+IF(AG37=\"-\",0,AG37),IF(I37<>\"\",I37-5,\"\")),\"\")","v":""},{"$f":"IF(B37=0,\"\",IF(L$1=0,0,Daten!B$10))","v":""},{"$f":"IF(B37=0,\"\",IF(M$1=0,0,Daten!B$11))","v":""},{"$f":"IF(B37=0,\"\",IF(N$1=0,0,Daten!B$12))","v":""},"",{"$f":"IF(B37=0,\"\",Daten!B$6)","v":""},{"$f":"IF(B37=0,\"\",Daten!B$16)","v":""},{"$f":"IF(B37=0,\"\",IF(Daten!B$1=TRUE,Daten!B$17,\"-\"))","v":""},{"$f":"IF(B37=0,\"\",IF(C37=\"Nein\",\"-\",Daten!D$7))","v":""},{"$f":"IF(B37=\"\",\"\",IF(C37=\"Nein\",\"-\",IF(T$1=0,\"\",Daten!D$12)))","v":""},{"$f":"IF(B37=\"\",\"\",IF(C37=\"Nein\",\"-\",IF(T$1=0,\"\",Daten!D$13)))","v":""},{"$f":"IF(B37=\"\",\"\",IF(C37=\"Nein\",\"-\",IF(T$1=0,\"\",IF(AK37=\"\",\"\",AK37+X37-Daten!D$20))))","v":""},{"$f":"IF(B37=0,\"\",IF(L$1=1,M37+N37,Daten!D$2))","v":""},{"$f":"IF(B37=0,\"\",IF(C37=\"Nein\",\"-\",Daten!D$6))","v":""},{"$f":"IF(B37=0,\"\",IF(C37=\"Nein\",\"-\",Daten!D$3))","v":""},{"$f":"IF(B37=0,\"\",Daten!D$4)","v":""},{"$f":"IF(B37=0,\"\",IF(C37=\"Nein\",\"-\",Daten!D$5))","v":""},{"$f":"IF(B37=0,\"\",IF(Daten!F$1=\"Keine\",Daten!A$45,IF(Daten!F$7=TRUE,Daten!A$48,Daten!A$44)))","v":""},{"$f":"IF(B37=0,\"\",IF(AB37=\"Standard\",IF(Daten!F$9=TRUE,1,0),0))","v":""},"",{"$f":"IF(B37=0,\"\",IF(OR(AB37=Daten!A$46,AB37=Daten!A$47,AB37=Daten!A$48),AI37+W37,\"-\"))","v":""},{"$f":"IF(B37=0,\"\",IF(AB37=Daten!A$45,\"-\",Daten!F$5))","v":""},{"$f":"IF(B37=0,\"\",IF(AB37=Daten!A$45,\"-\",Daten!F$4))","v":""},{"$f":"IF(B37=0,\"\",IF(AB37=Daten!A$45,\"-\",Daten!F$6))","v":""},{"$f":"IF(B37=0,\"\",IF(AB37=Daten!A$45,\"-\",Daten!F$2))","v":""},{"$f":"IF(B37=0,\"\",IF(AB37=Daten!A$45,\"-\",Daten!F$3))","v":""},"",{"$f":"IF(B37=0,\"\",IF(OR(C37=\"Nein\",Daten!D39=\"Ohne\"),\"-\",Daten!D$9))","v":""},{"$f":"IF(B37=0,\"\",IF(OR(C37=\"Nein\",Daten!D39=\"Ohne\"),\"-\",IF(Daten!D$8=\"Rahmendämmung\",Daten!D$10,\"-\")))","v":""},{"$f":"IF(B37=0,\"\",IF(AND(C37=\"Ja\",Daten!D$15=TRUE),Daten!D$16,\"-\"))","v":""},{"$f":"IF(AN37=\"\",\"\",IF(AND(C37=\"Ja\",Daten!D$15=TRUE),Daten!D$18,\"-\"))","v":""},{"$f":"IF(B37=0,\"\",IF(Daten!H$7=TRUE,\"bauseits\",IF(Daten!H$8=TRUE,\"FSP 40\",\"WSP 40\")))","v":""},{"$f":"IF(B37=0,\"\",Daten!H$10)","v":""},{"$f":"IFERROR(IF(B37=0,\"\",IF(Daten!H$2=TRUE,1,0)*IF(J37+P37+P37+Q37+Q37>Daten!B$62,0,1)*IF(K37+P37+Z37+AF37+10>Daten!B$62,0,1)),0)","v":""}]
[null,null,{"$f":"IF(A38=\"\",\"\",IF(Daten!D$1<>\"Keine\",\"Ja\",\"Nein\"))","v":""},{"$f":"IF(A38=\"\",\"\",IF(Daten!B$4=TRUE,\"QB\",\"BS\")&IF(AR38=1,\"G\",\"\")&IF(C38=\"Nein\",\"-V\",IF(Daten!D$11=TRUE,\"-S\",\"-H\"))&IF(Daten!B$1=TRUE,\"-E\",\"\")&IF(Daten!F$9=TRUE,\"-B\",\"\")&IF(Daten!F$8=TRUE,\"A\",\"\"))","v":""},{"$f":"IF(A38=\"\",\"\",IFERROR(VLOOKUP(D38,Daten!D$43:G$94,2,FALSE),\"spez.\"))","v":""},null,null,null,null,{"$f":"IF(F38<>\"\",F38+(2*(Daten!B$13+2)),IF(H38<>\"\",H38-10,\"\"))","v":""},{"$f":"IFERROR(IF(G38<>\"\",G38+Daten!B$14+Daten!B$15+2+IF(AG38=\"-\",0,AG38),IF(I38<>\"\",I38-5,\"\")),\"\")","v":""},{"$f":"IF(B38=0,\"\",IF(L$1=0,0,Daten!B$10))","v":""},{"$f":"IF(B38=0,\"\",IF(M$1=0,0,Daten!B$11))","v":""},{"$f":"IF(B38=0,\"\",IF(N$1=0,0,Daten!B$12))","v":""},"",{"$f":"IF(B38=0,\"\",Daten!B$6)","v":""},{"$f":"IF(B38=0,\"\",Daten!B$16)","v":""},{"$f":"IF(B38=0,\"\",IF(Daten!B$1=TRUE,Daten!B$17,\"-\"))","v":""},{"$f":"IF(B38=0,\"\",IF(C38=\"Nein\",\"-\",Daten!D$7))","v":""},{"$f":"IF(B38=\"\",\"\",IF(C38=\"Nein\",\"-\",IF(T$1=0,\"\",Daten!D$12)))","v":""},{"$f":"IF(B38=\"\",\"\",IF(C38=\"Nein\",\"-\",IF(T$1=0,\"\",Daten!D$13)))","v":""},{"$f":"IF(B38=\"\",\"\",IF(C38=\"Nein\",\"-\",IF(T$1=0,\"\",IF(AK38=\"\",\"\",AK38+X38-Daten!D$20))))","v":""},{"$f":"IF(B38=0,\"\",IF(L$1=1,M38+N38,Daten!D$2))","v":""},{"$f":"IF(B38=0,\"\",IF(C38=\"Nein\",\"-\",Daten!D$6))","v":""},{"$f":"IF(B38=0,\"\",IF(C38=\"Nein\",\"-\",Daten!D$3))","v":""},{"$f":"IF(B38=0,\"\",Daten!D$4)","v":""},{"$f":"IF(B38=0,\"\",IF(C38=\"Nein\",\"-\",Daten!D$5))","v":""},{"$f":"IF(B38=0,\"\",IF(Daten!F$1=\"Keine\",Daten!A$45,IF(Daten!F$7=TRUE,Daten!A$48,Daten!A$44)))","v":""},{"$f":"IF(B38=0,\"\",IF(AB38=\"Standard\",IF(Daten!F$9=TRUE,1,0),0))","v":""},"",{"$f":"IF(B38=0,\"\",IF(OR(AB38=Daten!A$46,AB38=Daten!A$47,AB38=Daten!A$48),AI38+W38,\"-\"))","v":""},{"$f":"IF(B38=0,\"\",IF(AB38=Daten!A$45,\"-\",Daten!F$5))","v":""},{"$f":"IF(B38=0,\"\",IF(AB38=Daten!A$45,\"-\",Daten!F$4))","v":""},{"$f":"IF(B38=0,\"\",IF(AB38=Daten!A$45,\"-\",Daten!F$6))","v":""},{"$f":"IF(B38=0,\"\",IF(AB38=Daten!A$45,\"-\",Daten!F$2))","v":""},{"$f":"IF(B38=0,\"\",IF(AB38=Daten!A$45,\"-\",Daten!F$3))","v":""},"",{"$f":"IF(B38=0,\"\",IF(OR(C38=\"Nein\",Daten!D40=\"Ohne\"),\"-\",Daten!D$9))","v":""},{"$f":"IF(B38=0,\"\",IF(OR(C38=\"Nein\",Daten!D40=\"Ohne\"),\"-\",IF(Daten!D$8=\"Rahmendämmung\",Daten!D$10,\"-\")))","v":""},{"$f":"IF(B38=0,\"\",IF(AND(C38=\"Ja\",Daten!D$15=TRUE),Daten!D$16,\"-\"))","v":""},{"$f":"IF(AN38=\"\",\"\",IF(AND(C38=\"Ja\",Daten!D$15=TRUE),Daten!D$18,\"-\"))","v":""},{"$f":"IF(B38=0,\"\",IF(Daten!H$7=TRUE,\"bauseits\",IF(Daten!H$8=TRUE,\"FSP 40\",\"WSP 40\")))","v":""},{"$f":"IF(B38=0,\"\",Daten!H$10)","v":""},{"$f":"IFERROR(IF(B38=0,\"\",IF(Daten!H$2=TRUE,1,0)*IF(J38+P38+P38+Q38+Q38>Daten!B$62,0,1)*IF(K38+P38+Z38+AF38+10>Daten!B$62,0,1)),0)","v":""}]
[null,null,{"$f":"IF(A39=\"\",\"\",IF(Daten!D$1<>\"Keine\",\"Ja\",\"Nein\"))","v":""},{"$f":"IF(A39=\"\",\"\",IF(Daten!B$4=TRUE,\"QB\",\"BS\")&IF(AR39=1,\"G\",\"\")&IF(C39=\"Nein\",\"-V\",IF(Daten!D$11=TRUE,\"-S\",\"-H\"))&IF(Daten!B$1=TRUE,\"-E\",\"\")&IF(Daten!F$9=TRUE,\"-B\",\"\")&IF(Daten!F$8=TRUE,\"A\",\"\"))","v":""},{"$f":"IF(A39=\"\",\"\",IFERROR(VLOOKUP(D39,Daten!D$43:G$94,2,FALSE),\"spez.\"))","v":""},null,null,null,null,{"$f":"IF(F39<>\"\",F39+(2*(Daten!B$13+2)),IF(H39<>\"\",H39-10,\"\"))","v":""},{"$f":"IFERROR(IF(G39<>\"\",G39+Daten!B$14+Daten!B$15+2+IF(AG39=\"-\",0,AG39),IF(I39<>\"\",I39-5,\"\")),\"\")","v":""},{"$f":"IF(B39=0,\"\",IF(L$1=0,0,Daten!B$10))","v":""},{"$f":"IF(B39=0,\"\",IF(M$1=0,0,Daten!B$11))","v":""},{"$f":"IF(B39=0,\"\",IF(N$1=0,0,Daten!B$12))","v":""},"",{"$f":"IF(B39=0,\"\",Daten!B$6)","v":""},{"$f":"IF(B39=0,\"\",Daten!B$16)","v":""},{"$f":"IF(B39=0,\"\",IF(Daten!B$1=TRUE,Daten!B$17,\"-\"))","v":""},{"$f":"IF(B39=0,\"\",IF(C39=\"Nein\",\"-\",Daten!D$7))","v":""},{"$f":"IF(B39=\"\",\"\",IF(C39=\"Nein\",\"-\",IF(T$1=0,\"\",Daten!D$12)))","v":""},{"$f":"IF(B39=\"\",\"\",IF(C39=\"Nein\",\"-\",IF(T$1=0,\"\",Daten!D$13)))","v":""},{"$f":"IF(B39=\"\",\"\",IF(C39=\"Nein\",\"-\",IF(T$1=0,\"\",IF(AK39=\"\",\"\",AK39+X39-Daten!D$20))))","v":""},{"$f":"IF(B39=0,\"\",IF(L$1=1,M39+N39,Daten!D$2))","v":""},{"$f":"IF(B39=0,\"\",IF(C39=\"Nein\",\"-\",Daten!D$6))","v":""},{"$f":"IF(B39=0,\"\",IF(C39=\"Nein\",\"-\",Daten!D$3))","v":""},{"$f":"IF(B39=0,\"\",Daten!D$4)","v":""},{"$f":"IF(B39=0,\"\",IF(C39=\"Nein\",\"-\",Daten!D$5))","v":""},{"$f":"IF(B39=0,\"\",IF(Daten!F$1=\"Keine\",Daten!A$45,IF(Daten!F$7=TRUE,Daten!A$48,Daten!A$44)))","v":""},{"$f":"IF(B39=0,\"\",IF(AB39=\"Standard\",IF(Daten!F$9=TRUE,1,0),0))","v":""},"",{"$f":"IF(B39=0,\"\",IF(OR(AB39=Daten!A$46,AB39=Daten!A$47,AB39=Daten!A$48),AI39+W39,\"-\"))","v":""},{"$f":"IF(B39=0,\"\",IF(AB39=Daten!A$45,\"-\",Daten!F$5))","v":""},{"$f":"IF(B39=0,\"\",IF(AB39=Daten!A$45,\"-\",Daten!F$4))","v":""},{"$f":"IF(B39=0,\"\",IF(AB39=Daten!A$45,\"-\",Daten!F$6))","v":""},{"$f":"IF(B39=0,\"\",IF(AB39=Daten!A$45,\"-\",Daten!F$2))","v":""},{"$f":"IF(B39=0,\"\",IF(AB39=Daten!A$45,\"-\",Daten!F$3))","v":""},"",{"$f":"IF(B39=0,\"\",IF(OR(C39=\"Nein\",Daten!D41=\"Ohne\"),\"-\",Daten!D$9))","v":""},{"$f":"IF(B39=0,\"\",IF(OR(C39=\"Nein\",Daten!D41=\"Ohne\"),\"-\",IF(Daten!D$8=\"Rahmendämmung\",Daten!D$10,\"-\")))","v":""},{"$f":"IF(B39=0,\"\",IF(AND(C39=\"Ja\",Daten!D$15=TRUE),Daten!D$16,\"-\"))","v":""},{"$f":"IF(AN39=\"\",\"\",IF(AND(C39=\"Ja\",Daten!D$15=TRUE),Daten!D$18,\"-\"))","v":""},{"$f":"IF(B39=0,\"\",IF(Daten!H$7=TRUE,\"bauseits\",IF(Daten!H$8=TRUE,\"FSP 40\",\"WSP 40\")))","v":""},{"$f":"IF(B39=0,\"\",Daten!H$10)","v":""},{"$f":"IFERROR(IF(B39=0,\"\",IF(Daten!H$2=TRUE,1,0)*IF(J39+P39+P39+Q39+Q39>Daten!B$62,0,1)*IF(K39+P39+Z39+AF39+10>Daten!B$62,0,1)),0)","v":""}]
[null,null,{"$f":"IF(A40=\"\",\"\",IF(Daten!D$1<>\"Keine\",\"Ja\",\"Nein\"))","v":""},{"$f":"IF(A40=\"\",\"\",IF(Daten!B$4=TRUE,\"QB\",\"BS\")&IF(AR40=1,\"G\",\"\")&IF(C40=\"Nein\",\"-V\",IF(Daten!D$11=TRUE,\"-S\",\"-H\"))&IF(Daten!B$1=TRUE,\"-E\",\"\")&IF(Daten!F$9=TRUE,\"-B\",\"\")&IF(Daten!F$8=TRUE,\"A\",\"\"))","v":""},{"$f":"IF(A40=\"\",\"\",IFERROR(VLOOKUP(D40,Daten!D$43:G$94,2,FALSE),\"spez.\"))","v":""},null,null,null,null,{"$f":"IF(F40<>\"\",F40+(2*(Daten!B$13+2)),IF(H40<>\"\",H40-10,\"\"))","v":""},{"$f":"IFERROR(IF(G40<>\"\",G40+Daten!B$14+Daten!B$15+2+IF(AG40=\"-\",0,AG40),IF(I40<>\"\",I40-5,\"\")),\"\")","v":""},{"$f":"IF(B40=0,\"\",IF(L$1=0,0,Daten!B$10))","v":""},{"$f":"IF(B40=0,\"\",IF(M$1=0,0,Daten!B$11))","v":""},{"$f":"IF(B40=0,\"\",IF(N$1=0,0,Daten!B$12))","v":""},"",{"$f":"IF(B40=0,\"\",Daten!B$6)","v":""},{"$f":"IF(B40=0,\"\",Daten!B$16)","v":""},{"$f":"IF(B40=0,\"\",IF(Daten!B$1=TRUE,Daten!B$17,\"-\"))","v":""},{"$f":"IF(B40=0,\"\",IF(C40=\"Nein\",\"-\",Daten!D$7))","v":""},{"$f":"IF(B40=\"\",\"\",IF(C40=\"Nein\",\"-\",IF(T$1=0,\"\",Daten!D$12)))","v":""},{"$f":"IF(B40=\"\",\"\",IF(C40=\"Nein\",\"-\",IF(T$1=0,\"\",Daten!D$13)))","v":""},{"$f":"IF(B40=\"\",\"\",IF(C40=\"Nein\",\"-\",IF(T$1=0,\"\",IF(AK40=\"\",\"\",AK40+X40-Daten!D$20))))","v":""},{"$f":"IF(B40=0,\"\",IF(L$1=1,M40+N40,Daten!D$2))","v":""},{"$f":"IF(B40=0,\"\",IF(C40=\"Nein\",\"-\",Daten!D$6))","v":""},{"$f":"IF(B40=0,\"\",IF(C40=\"Nein\",\"-\",Daten!D$3))","v":""},{"$f":"IF(B40=0,\"\",Daten!D$4)","v":""},{"$f":"IF(B40=0,\"\",IF(C40=\"Nein\",\"-\",Daten!D$5))","v":""},{"$f":"IF(B40=0,\"\",IF(Daten!F$1=\"Keine\",Daten!A$45,IF(Daten!F$7=TRUE,Daten!A$48,Daten!A$44)))","v":""},{"$f":"IF(B40=0,\"\",IF(AB40=\"Standard\",IF(Daten!F$9=TRUE,1,0),0))","v":""},"",{"$f":"IF(B40=0,\"\",IF(OR(AB40=Daten!A$46,AB40=Daten!A$47,AB40=Daten!A$48),AI40+W40,\"-\"))","v":""},{"$f":"IF(B40=0,\"\",IF(AB40=Daten!A$45,\"-\",Daten!F$5))","v":""},{"$f":"IF(B40=0,\"\",IF(AB40=Daten!A$45,\"-\",Daten!F$4))","v":""},{"$f":"IF(B40=0,\"\",IF(AB40=Daten!A$45,\"-\",Daten!F$6))","v":""},{"$f":"IF(B40=0,\"\",IF(AB40=Daten!A$45,\"-\",Daten!F$2))","v":""},{"$f":"IF(B40=0,\"\",IF(AB40=Daten!A$45,\"-\",Daten!F$3))","v":""},"",{"$f":"IF(B40=0,\"\",IF(OR(C40=\"Nein\",Daten!D42=\"Ohne\"),\"-\",Daten!D$9))","v":""},{"$f":"IF(B40=0,\"\",IF(OR(C40=\"Nein\",Daten!D42=\"Ohne\"),\"-\",IF(Daten!D$8=\"Rahmendämmung\",Daten!D$10,\"-\")))","v":""},{"$f":"IF(B40=0,\"\",IF(AND(C40=\"Ja\",Daten!D$15=TRUE),Daten!D$16,\"-\"))","v":""},{"$f":"IF(AN40=\"\",\"\",IF(AND(C40=\"Ja\",Daten!D$15=TRUE),Daten!D$18,\"-\"))","v":""},{"$f":"IF(B40=0,\"\",IF(Daten!H$7=TRUE,\"bauseits\",IF(Daten!H$8=TRUE,\"FSP 40\",\"WSP 40\")))","v":""},{"$f":"IF(B40=0,\"\",Daten!H$10)","v":""},{"$f":"IFERROR(IF(B40=0,\"\",IF(Daten!H$2=TRUE,1,0)*IF(J40+P40+P40+Q40+Q40>Daten!B$62,0,1)*IF(K40+P40+Z40+AF40+10>Daten!B$62,0,1)),0)","v":""}]
[null,null,{"$f":"IF(A41=\"\",\"\",IF(Daten!D$1<>\"Keine\",\"Ja\",\"Nein\"))","v":""},{"$f":"IF(A41=\"\",\"\",IF(Daten!B$4=TRUE,\"QB\",\"BS\")&IF(AR41=1,\"G\",\"\")&IF(C41=\"Nein\",\"-V\",IF(Daten!D$11=TRUE,\"-S\",\"-H\"))&IF(Daten!B$1=TRUE,\"-E\",\"\")&IF(Daten!F$9=TRUE,\"-B\",\"\")&IF(Daten!F$8=TRUE,\"A\",\"\"))","v":""},{"$f":"IF(A41=\"\",\"\",IFERROR(VLOOKUP(D41,Daten!D$43:G$94,2,FALSE),\"spez.\"))","v":""},null,null,null,null,{"$f":"IF(F41<>\"\",F41+(2*(Daten!B$13+2)),IF(H41<>\"\",H41-10,\"\"))","v":""},{"$f":"IFERROR(IF(G41<>\"\",G41+Daten!B$14+Daten!B$15+2+IF(AG41=\"-\",0,AG41),IF(I41<>\"\",I41-5,\"\")),\"\")","v":""},{"$f":"IF(B41=0,\"\",IF(L$1=0,0,Daten!B$10))","v":""},{"$f":"IF(B41=0,\"\",IF(M$1=0,0,Daten!B$11))","v":""},{"$f":"IF(B41=0,\"\",IF(N$1=0,0,Daten!B$12))","v":""},"",{"$f":"IF(B41=0,\"\",Daten!B$6)","v":""},{"$f":"IF(B41=0,\"\",Daten!B$16)","v":""},{"$f":"IF(B41=0,\"\",IF(Daten!B$1=TRUE,Daten!B$17,\"-\"))","v":""},{"$f":"IF(B41=0,\"\",IF(C41=\"Nein\",\"-\",Daten!D$7))","v":""},{"$f":"IF(B41=\"\",\"\",IF(C41=\"Nein\",\"-\",IF(T$1=0,\"\",Daten!D$12)))","v":""},{"$f":"IF(B41=\"\",\"\",IF(C41=\"Nein\",\"-\",IF(T$1=0,\"\",Daten!D$13)))","v":""},{"$f":"IF(B41=\"\",\"\",IF(C41=\"Nein\",\"-\",IF(T$1=0,\"\",IF(AK41=\"\",\"\",AK41+X41-Daten!D$20))))","v":""},{"$f":"IF(B41=0,\"\",IF(L$1=1,M41+N41,Daten!D$2))","v":""},{"$f":"IF(B41=0,\"\",IF(C41=\"Nein\",\"-\",Daten!D$6))","v":""},{"$f":"IF(B41=0,\"\",IF(C41=\"Nein\",\"-\",Daten!D$3))","v":""},{"$f":"IF(B41=0,\"\",Daten!D$4)","v":""},{"$f":"IF(B41=0,\"\",IF(C41=\"Nein\",\"-\",Daten!D$5))","v":""},{"$f":"IF(B41=0,\"\",IF(Daten!F$1=\"Keine\",Daten!A$45,IF(Daten!F$7=TRUE,Daten!A$48,Daten!A$44)))","v":""},{"$f":"IF(B41=0,\"\",IF(AB41=\"Standard\",IF(Daten!F$9=TRUE,1,0),0))","v":""},"",{"$f":"IF(B41=0,\"\",IF(OR(AB41=Daten!A$46,AB41=Daten!A$47,AB41=Daten!A$48),AI41+W41,\"-\"))","v":""},{"$f":"IF(B41=0,\"\",IF(AB41=Daten!A$45,\"-\",Daten!F$5))","v":""},{"$f":"IF(B41=0,\"\",IF(AB41=Daten!A$45,\"-\",Daten!F$4))","v":""},{"$f":"IF(B41=0,\"\",IF(AB41=Daten!A$45,\"-\",Daten!F$6))","v":""},{"$f":"IF(B41=0,\"\",IF(AB41=Daten!A$45,\"-\",Daten!F$2))","v":""},{"$f":"IF(B41=0,\"\",IF(AB41=Daten!A$45,\"-\",Daten!F$3))","v":""},"",{"$f":"IF(B41=0,\"\",IF(OR(C41=\"Nein\",Daten!D43=\"Ohne\"),\"-\",Daten!D$9))","v":""},{"$f":"IF(B41=0,\"\",IF(OR(C41=\"Nein\",Daten!D43=\"Ohne\"),\"-\",IF(Daten!D$8=\"Rahmendämmung\",Daten!D$10,\"-\")))","v":""},{"$f":"IF(B41=0,\"\",IF(AND(C41=\"Ja\",Daten!D$15=TRUE),Daten!D$16,\"-\"))","v":""},{"$f":"IF(AN41=\"\",\"\",IF(AND(C41=\"Ja\",Daten!D$15=TRUE),Daten!D$18,\"-\"))","v":""},{"$f":"IF(B41=0,\"\",IF(Daten!H$7=TRUE,\"bauseits\",IF(Daten!H$8=TRUE,\"FSP 40\",\"WSP 40\")))","v":""},{"$f":"IF(B41=0,\"\",Daten!H$10)","v":""},{"$f":"IFERROR(IF(B41=0,\"\",IF(Daten!H$2=TRUE,1,0)*IF(J41+P41+P41+Q41+Q41>Daten!B$62,0,1)*IF(K41+P41+Z41+AF41+10>Daten!B$62,0,1)),0)","v":""}]
[null,null,{"$f":"IF(A42=\"\",\"\",IF(Daten!D$1<>\"Keine\",\"Ja\",\"Nein\"))","v":""},{"$f":"IF(A42=\"\",\"\",IF(Daten!B$4=TRUE,\"QB\",\"BS\")&IF(AR42=1,\"G\",\"\")&IF(C42=\"Nein\",\"-V\",IF(Daten!D$11=TRUE,\"-S\",\"-H\"))&IF(Daten!B$1=TRUE,\"-E\",\"\")&IF(Daten!F$9=TRUE,\"-B\",\"\")&IF(Daten!F$8=TRUE,\"A\",\"\"))","v":""},{"$f":"IF(A42=\"\",\"\",IFERROR(VLOOKUP(D42,Daten!D$43:G$94,2,FALSE),\"spez.\"))","v":""},null,null,null,null,{"$f":"IF(F42<>\"\",F42+(2*(Daten!B$13+2)),IF(H42<>\"\",H42-10,\"\"))","v":""},{"$f":"IFERROR(IF(G42<>\"\",G42+Daten!B$14+Daten!B$15+2+IF(AG42=\"-\",0,AG42),IF(I42<>\"\",I42-5,\"\")),\"\")","v":""},{"$f":"IF(B42=0,\"\",IF(L$1=0,0,Daten!B$10))","v":""},{"$f":"IF(B42=0,\"\",IF(M$1=0,0,Daten!B$11))","v":""},{"$f":"IF(B42=0,\"\",IF(N$1=0,0,Daten!B$12))","v":""},"",{"$f":"IF(B42=0,\"\",Daten!B$6)","v":""},{"$f":"IF(B42=0,\"\",Daten!B$16)","v":""},{"$f":"IF(B42=0,\"\",IF(Daten!B$1=TRUE,Daten!B$17,\"-\"))","v":""},{"$f":"IF(B42=0,\"\",IF(C42=\"Nein\",\"-\",Daten!D$7))","v":""},{"$f":"IF(B42=\"\",\"\",IF(C42=\"Nein\",\"-\",IF(T$1=0,\"\",Daten!D$12)))","v":""},{"$f":"IF(B42=\"\",\"\",IF(C42=\"Nein\",\"-\",IF(T$1=0,\"\",Daten!D$13)))","v":""},{"$f":"IF(B42=\"\",\"\",IF(C42=\"Nein\",\"-\",IF(T$1=0,\"\",IF(AK42=\"\",\"\",AK42+X42-Daten!D$20))))","v":""},{"$f":"IF(B42=0,\"\",IF(L$1=1,M42+N42,Daten!D$2))","v":""},{"$f":"IF(B42=0,\"\",IF(C42=\"Nein\",\"-\",Daten!D$6))","v":""},{"$f":"IF(B42=0,\"\",IF(C42=\"Nein\",\"-\",Daten!D$3))","v":""},{"$f":"IF(B42=0,\"\",Daten!D$4)","v":""},{"$f":"IF(B42=0,\"\",IF(C42=\"Nein\",\"-\",Daten!D$5))","v":""},{"$f":"IF(B42=0,\"\",IF(Daten!F$1=\"Keine\",Daten!A$45,IF(Daten!F$7=TRUE,Daten!A$48,Daten!A$44)))","v":""},{"$f":"IF(B42=0,\"\",IF(AB42=\"Standard\",IF(Daten!F$9=TRUE,1,0),0))","v":""},"",{"$f":"IF(B42=0,\"\",IF(OR(AB42=Daten!A$46,AB42=Daten!A$47,AB42=Daten!A$48),AI42+W42,\"-\"))","v":""},{"$f":"IF(B42=0,\"\",IF(AB42=Daten!A$45,\"-\",Daten!F$5))","v":""},{"$f":"IF(B42=0,\"\",IF(AB42=Daten!A$45,\"-\",Daten!F$4))","v":""},{"$f":"IF(B42=0,\"\",IF(AB42=Daten!A$45,\"-\",Daten!F$6))","v":""},{"$f":"IF(B42=0,\"\",IF(AB42=Daten!A$45,\"-\",Daten!F$2))","v":""},{"$f":"IF(B42=0,\"\",IF(AB42=Daten!A$45,\"-\",Daten!F$3))","v":""},"",{"$f":"IF(B42=0,\"\",IF(OR(C42=\"Nein\",Daten!D44=\"Ohne\"),\"-\",Daten!D$9))","v":""},{"$f":"IF(B42=0,\"\",IF(OR(C42=\"Nein\",Daten!D44=\"Ohne\"),\"-\",IF(Daten!D$8=\"Rahmendämmung\",Daten!D$10,\"-\")))","v":""},{"$f":"IF(B42=0,\"\",IF(AND(C42=\"Ja\",Daten!D$15=TRUE),Daten!D$16,\"-\"))","v":""},{"$f":"IF(AN42=\"\",\"\",IF(AND(C42=\"Ja\",Daten!D$15=TRUE),Daten!D$18,\"-\"))","v":""},{"$f":"IF(B42=0,\"\",IF(Daten!H$7=TRUE,\"bauseits\",IF(Daten!H$8=TRUE,\"FSP 40\",\"WSP 40\")))","v":""},{"$f":"IF(B42=0,\"\",Daten!H$10)","v":""},{"$f":"IFERROR(IF(B42=0,\"\",IF(Daten!H$2=TRUE,1,0)*IF(J42+P42+P42+Q42+Q42>Daten!B$62,0,1)*IF(K42+P42+Z42+AF42+10>Daten!B$62,0,1)),0)","v":""}]
[null,null,{"$f":"IF(A43=\"\",\"\",IF(Daten!D$1<>\"Keine\",\"Ja\",\"Nein\"))","v":""},{"$f":"IF(A43=\"\",\"\",IF(Daten!B$4=TRUE,\"QB\",\"BS\")&IF(AR43=1,\"G\",\"\")&IF(C43=\"Nein\",\"-V\",IF(Daten!D$11=TRUE,\"-S\",\"-H\"))&IF(Daten!B$1=TRUE,\"-E\",\"\")&IF(Daten!F$9=TRUE,\"-B\",\"\")&IF(Daten!F$8=TRUE,\"A\",\"\"))","v":""},{"$f":"IF(A43=\"\",\"\",IFERROR(VLOOKUP(D43,Daten!D$43:G$94,2,FALSE),\"spez.\"))","v":""},null,null,null,null,{"$f":"IF(F43<>\"\",F43+(2*(Daten!B$13+2)),IF(H43<>\"\",H43-10,\"\"))","v":""},{"$f":"IFERROR(IF(G43<>\"\",G43+Daten!B$14+Daten!B$15+2+IF(AG43=\"-\",0,AG43),IF(I43<>\"\",I43-5,\"\")),\"\")","v":""},{"$f":"IF(B43=0,\"\",IF(L$1=0,0,Daten!B$10))","v":""},{"$f":"IF(B43=0,\"\",IF(M$1=0,0,Daten!B$11))","v":""},{"$f":"IF(B43=0,\"\",IF(N$1=0,0,Daten!B$12))","v":""},"",{"$f":"IF(B43=0,\"\",Daten!B$6)","v":""},{"$f":"IF(B43=0,\"\",Daten!B$16)","v":""},{"$f":"IF(B43=0,\"\",IF(Daten!B$1=TRUE,Daten!B$17,\"-\"))","v":""},{"$f":"IF(B43=0,\"\",IF(C43=\"Nein\",\"-\",Daten!D$7))","v":""},{"$f":"IF(B43=\"\",\"\",IF(C43=\"Nein\",\"-\",IF(T$1=0,\"\",Daten!D$12)))","v":""},{"$f":"IF(B43=\"\",\"\",IF(C43=\"Nein\",\"-\",IF(T$1=0,\"\",Daten!D$13)))","v":""},{"$f":"IF(B43=\"\",\"\",IF(C43=\"Nein\",\"-\",IF(T$1=0,\"\",IF(AK43=\"\",\"\",AK43+X43-Daten!D$20))))","v":""},{"$f":"IF(B43=0,\"\",IF(L$1=1,M43+N43,Daten!D$2))","v":""},{"$f":"IF(B43=0,\"\",IF(C43=\"Nein\",\"-\",Daten!D$6))","v":""},{"$f":"IF(B43=0,\"\",IF(C43=\"Nein\",\"-\",Daten!D$3))","v":""},{"$f":"IF(B43=0,\"\",Daten!D$4)","v":""},{"$f":"IF(B43=0,\"\",IF(C43=\"Nein\",\"-\",Daten!D$5))","v":""},{"$f":"IF(B43=0,\"\",IF(Daten!F$1=\"Keine\",Daten!A$45,IF(Daten!F$7=TRUE,Daten!A$48,Daten!A$44)))","v":""},{"$f":"IF(B43=0,\"\",IF(AB43=\"Standard\",IF(Daten!F$9=TRUE,1,0),0))","v":""},"",{"$f":"IF(B43=0,\"\",IF(OR(AB43=Daten!A$46,AB43=Daten!A$47,AB43=Daten!A$48),AI43+W43,\"-\"))","v":""},{"$f":"IF(B43=0,\"\",IF(AB43=Daten!A$45,\"-\",Daten!F$5))","v":""},{"$f":"IF(B43=0,\"\",IF(AB43=Daten!A$45,\"-\",Daten!F$4))","v":""},{"$f":"IF(B43=0,\"\",IF(AB43=Daten!A$45,\"-\",Daten!F$6))","v":""},{"$f":"IF(B43=0,\"\",IF(AB43=Daten!A$45,\"-\",Daten!F$2))","v":""},{"$f":"IF(B43=0,\"\",IF(AB43=Daten!A$45,\"-\",Daten!F$3))","v":""},"",{"$f":"IF(B43=0,\"\",IF(OR(C43=\"Nein\",Daten!D45=\"Ohne\"),\"-\",Daten!D$9))","v":""},{"$f":"IF(B43=0,\"\",IF(OR(C43=\"Nein\",Daten!D45=\"Ohne\"),\"-\",IF(Daten!D$8=\"Rahmendämmung\",Daten!D$10,\"-\")))","v":""},{"$f":"IF(B43=0,\"\",IF(AND(C43=\"Ja\",Daten!D$15=TRUE),Daten!D$16,\"-\"))","v":""},{"$f":"IF(AN43=\"\",\"\",IF(AND(C43=\"Ja\",Daten!D$15=TRUE),Daten!D$18,\"-\"))","v":""},{"$f":"IF(B43=0,\"\",IF(Daten!H$7=TRUE,\"bauseits\",IF(Daten!H$8=TRUE,\"FSP 40\",\"WSP 40\")))","v":""},{"$f":"IF(B43=0,\"\",Daten!H$10)","v":""},{"$f":"IFERROR(IF(B43=0,\"\",IF(Daten!H$2=TRUE,1,0)*IF(J43+P43+P43+Q43+Q43>Daten!B$62,0,1)*IF(K43+P43+Z43+AF43+10>Daten!B$62,0,1)),0)","v":""}]
[null,null,{"$f":"IF(A44=\"\",\"\",IF(Daten!D$1<>\"Keine\",\"Ja\",\"Nein\"))","v":""},{"$f":"IF(A44=\"\",\"\",IF(Daten!B$4=TRUE,\"QB\",\"BS\")&IF(AR44=1,\"G\",\"\")&IF(C44=\"Nein\",\"-V\",IF(Daten!D$11=TRUE,\"-S\",\"-H\"))&IF(Daten!B$1=TRUE,\"-E\",\"\")&IF(Daten!F$9=TRUE,\"-B\",\"\")&IF(Daten!F$8=TRUE,\"A\",\"\"))","v":""},{"$f":"IF(A44=\"\",\"\",IFERROR(VLOOKUP(D44,Daten!D$43:G$94,2,FALSE),\"spez.\"))","v":""},null,null,null,null,{"$f":"IF(F44<>\"\",F44+(2*(Daten!B$13+2)),IF(H44<>\"\",H44-10,\"\"))","v":""},{"$f":"IFERROR(IF(G44<>\"\",G44+Daten!B$14+Daten!B$15+2+IF(AG44=\"-\",0,AG44),IF(I44<>\"\",I44-5,\"\")),\"\")","v":""},{"$f":"IF(B44=0,\"\",IF(L$1=0,0,Daten!B$10))","v":""},{"$f":"IF(B44=0,\"\",IF(M$1=0,0,Daten!B$11))","v":""},{"$f":"IF(B44=0,\"\",IF(N$1=0,0,Daten!B$12))","v":""},"",{"$f":"IF(B44=0,\"\",Daten!B$6)","v":""},{"$f":"IF(B44=0,\"\",Daten!B$16)","v":""},{"$f":"IF(B44=0,\"\",IF(Daten!B$1=TRUE,Daten!B$17,\"-\"))","v":""},{"$f":"IF(B44=0,\"\",IF(C44=\"Nein\",\"-\",Daten!D$7))","v":""},{"$f":"IF(B44=\"\",\"\",IF(C44=\"Nein\",\"-\",IF(T$1=0,\"\",Daten!D$12)))","v":""},{"$f":"IF(B44=\"\",\"\",IF(C44=\"Nein\",\"-\",IF(T$1=0,\"\",Daten!D$13)))","v":""},{"$f":"IF(B44=\"\",\"\",IF(C44=\"Nein\",\"-\",IF(T$1=0,\"\",IF(AK44=\"\",\"\",AK44+X44-Daten!D$20))))","v":""},{"$f":"IF(B44=0,\"\",IF(L$1=1,M44+N44,Daten!D$2))","v":""},{"$f":"IF(B44=0,\"\",IF(C44=\"Nein\",\"-\",Daten!D$6))","v":""},{"$f":"IF(B44=0,\"\",IF(C44=\"Nein\",\"-\",Daten!D$3))","v":""},{"$f":"IF(B44=0,\"\",Daten!D$4)","v":""},{"$f":"IF(B44=0,\"\",IF(C44=\"Nein\",\"-\",Daten!D$5))","v":""},{"$f":"IF(B44=0,\"\",IF(Daten!F$1=\"Keine\",Daten!A$45,IF(Daten!F$7=TRUE,Daten!A$48,Daten!A$44)))","v":""},{"$f":"IF(B44=0,\"\",IF(AB44=\"Standard\",IF(Daten!F$9=TRUE,1,0),0))","v":""},"",{"$f":"IF(B44=0,\"\",IF(OR(AB44=Daten!A$46,AB44=Daten!A$47,AB44=Daten!A$48),AI44+W44,\"-\"))","v":""},{"$f":"IF(B44=0,\"\",IF(AB44=Daten!A$45,\"-\",Daten!F$5))","v":""},{"$f":"IF(B44=0,\"\",IF(AB44=Daten!A$45,\"-\",Daten!F$4))","v":""},{"$f":"IF(B44=0,\"\",IF(AB44=Daten!A$45,\"-\",Daten!F$6))","v":""},{"$f":"IF(B44=0,\"\",IF(AB44=Daten!A$45,\"-\",Daten!F$2))","v":""},{"$f":"IF(B44=0,\"\",IF(AB44=Daten!A$45,\"-\",Daten!F$3))","v":""},"",{"$f":"IF(B44=0,\"\",IF(OR(C44=\"Nein\",Daten!D46=\"Ohne\"),\"-\",Daten!D$9))","v":""},{"$f":"IF(B44=0,\"\",IF(OR(C44=\"Nein\",Daten!D46=\"Ohne\"),\"-\",IF(Daten!D$8=\"Rahmendämmung\",Daten!D$10,\"-\")))","v":""},{"$f":"IF(B44=0,\"\",IF(AND(C44=\"Ja\",Daten!D$15=TRUE),Daten!D$16,\"-\"))","v":""},{"$f":"IF(AN44=\"\",\"\",IF(AND(C44=\"Ja\",Daten!D$15=TRUE),Daten!D$18,\"-\"))","v":""},{"$f":"IF(B44=0,\"\",IF(Daten!H$7=TRUE,\"bauseits\",IF(Daten!H$8=TRUE,\"FSP 40\",\"WSP 40\")))","v":""},{"$f":"IF(B44=0,\"\",Daten!H$10)","v":""},{"$f":"IFERROR(IF(B44=0,\"\",IF(Daten!H$2=TRUE,1,0)*IF(J44+P44+P44+Q44+Q44>Daten!B$62,0,1)*IF(K44+P44+Z44+AF44+10>Daten!B$62,0,1)),0)","v":""}]
[null,null,{"$f":"IF(A45=\"\",\"\",IF(Daten!D$1<>\"Keine\",\"Ja\",\"Nein\"))","v":""},{"$f":"IF(A45=\"\",\"\",IF(Daten!B$4=TRUE,\"QB\",\"BS\")&IF(AR45=1,\"G\",\"\")&IF(C45=\"Nein\",\"-V\",IF(Daten!D$11=TRUE,\"-S\",\"-H\"))&IF(Daten!B$1=TRUE,\"-E\",\"\")&IF(Daten!F$9=TRUE,\"-B\",\"\")&IF(Daten!F$8=TRUE,\"A\",\"\"))","v":""},{"$f":"IF(A45=\"\",\"\",IFERROR(VLOOKUP(D45,Daten!D$43:G$94,2,FALSE),\"spez.\"))","v":""},null,null,null,null,{"$f":"IF(F45<>\"\",F45+(2*(Daten!B$13+2)),IF(H45<>\"\",H45-10,\"\"))","v":""},{"$f":"IFERROR(IF(G45<>\"\",G45+Daten!B$14+Daten!B$15+2+IF(AG45=\"-\",0,AG45),IF(I45<>\"\",I45-5,\"\")),\"\")","v":""},{"$f":"IF(B45=0,\"\",IF(L$1=0,0,Daten!B$10))","v":""},{"$f":"IF(B45=0,\"\",IF(M$1=0,0,Daten!B$11))","v":""},{"$f":"IF(B45=0,\"\",IF(N$1=0,0,Daten!B$12))","v":""},"",{"$f":"IF(B45=0,\"\",Daten!B$6)","v":""},{"$f":"IF(B45=0,\"\",Daten!B$16)","v":""},{"$f":"IF(B45=0,\"\",IF(Daten!B$1=TRUE,Daten!B$17,\"-\"))","v":""},{"$f":"IF(B45=0,\"\",IF(C45=\"Nein\",\"-\",Daten!D$7))","v":""},{"$f":"IF(B45=\"\",\"\",IF(C45=\"Nein\",\"-\",IF(T$1=0,\"\",Daten!D$12)))","v":""},{"$f":"IF(B45=\"\",\"\",IF(C45=\"Nein\",\"-\",IF(T$1=0,\"\",Daten!D$13)))","v":""},{"$f":"IF(B45=\"\",\"\",IF(C45=\"Nein\",\"-\",IF(T$1=0,\"\",IF(AK45=\"\",\"\",AK45+X45-Daten!D$20))))","v":""},{"$f":"IF(B45=0,\"\",IF(L$1=1,M45+N45,Daten!D$2))","v":""},{"$f":"IF(B45=0,\"\",IF(C45=\"Nein\",\"-\",Daten!D$6))","v":""},{"$f":"IF(B45=0,\"\",IF(C45=\"Nein\",\"-\",Daten!D$3))","v":""},{"$f":"IF(B45=0,\"\",Daten!D$4)","v":""},{"$f":"IF(B45=0,\"\",IF(C45=\"Nein\",\"-\",Daten!D$5))","v":""},{"$f":"IF(B45=0,\"\",IF(Daten!F$1=\"Keine\",Daten!A$45,IF(Daten!F$7=TRUE,Daten!A$48,Daten!A$44)))","v":""},{"$f":"IF(B45=0,\"\",IF(AB45=\"Standard\",IF(Daten!F$9=TRUE,1,0),0))","v":""},"",{"$f":"IF(B45=0,\"\",IF(OR(AB45=Daten!A$46,AB45=Daten!A$47,AB45=Daten!A$48),AI45+W45,\"-\"))","v":""},{"$f":"IF(B45=0,\"\",IF(AB45=Daten!A$45,\"-\",Daten!F$5))","v":""},{"$f":"IF(B45=0,\"\",IF(AB45=Daten!A$45,\"-\",Daten!F$4))","v":""},{"$f":"IF(B45=0,\"\",IF(AB45=Daten!A$45,\"-\",Daten!F$6))","v":""},{"$f":"IF(B45=0,\"\",IF(AB45=Daten!A$45,\"-\",Daten!F$2))","v":""},{"$f":"IF(B45=0,\"\",IF(AB45=Daten!A$45,\"-\",Daten!F$3))","v":""},"",{"$f":"IF(B45=0,\"\",IF(OR(C45=\"Nein\",Daten!D47=\"Ohne\"),\"-\",Daten!D$9))","v":""},{"$f":"IF(B45=0,\"\",IF(OR(C45=\"Nein\",Daten!D47=\"Ohne\"),\"-\",IF(Daten!D$8=\"Rahmendämmung\",Daten!D$10,\"-\")))","v":""},{"$f":"IF(B45=0,\"\",IF(AND(C45=\"Ja\",Daten!D$15=TRUE),Daten!D$16,\"-\"))","v":""},{"$f":"IF(AN45=\"\",\"\",IF(AND(C45=\"Ja\",Daten!D$15=TRUE),Daten!D$18,\"-\"))","v":""},{"$f":"IF(B45=0,\"\",IF(Daten!H$7=TRUE,\"bauseits\",IF(Daten!H$8=TRUE,\"FSP 40\",\"WSP 40\")))","v":""},{"$f":"IF(B45=0,\"\",Daten!H$10)","v":""},{"$f":"IFERROR(IF(B45=0,\"\",IF(Daten!H$2=TRUE,1,0)*IF(J45+P45+P45+Q45+Q45>Daten!B$62,0,1)*IF(K45+P45+Z45+AF45+10>Daten!B$62,0,1)),0)","v":""}]
[null,null,{"$f":"IF(A46=\"\",\"\",IF(Daten!D$1<>\"Keine\",\"Ja\",\"Nein\"))","v":""},{"$f":"IF(A46=\"\",\"\",IF(Daten!B$4=TRUE,\"QB\",\"BS\")&IF(AR46=1,\"G\",\"\")&IF(C46=\"Nein\",\"-V\",IF(Daten!D$11=TRUE,\"-S\",\"-H\"))&IF(Daten!B$1=TRUE,\"-E\",\"\")&IF(Daten!F$9=TRUE,\"-B\",\"\")&IF(Daten!F$8=TRUE,\"A\",\"\"))","v":""},{"$f":"IF(A46=\"\",\"\",IFERROR(VLOOKUP(D46,Daten!D$43:G$94,2,FALSE),\"spez.\"))","v":""},null,null,null,null,{"$f":"IF(F46<>\"\",F46+(2*(Daten!B$13+2)),IF(H46<>\"\",H46-10,\"\"))","v":""},{"$f":"IFERROR(IF(G46<>\"\",G46+Daten!B$14+Daten!B$15+2+IF(AG46=\"-\",0,AG46),IF(I46<>\"\",I46-5,\"\")),\"\")","v":""},{"$f":"IF(B46=0,\"\",IF(L$1=0,0,Daten!B$10))","v":""},{"$f":"IF(B46=0,\"\",IF(M$1=0,0,Daten!B$11))","v":""},{"$f":"IF(B46=0,\"\",IF(N$1=0,0,Daten!B$12))","v":""},"",{"$f":"IF(B46=0,\"\",Daten!B$6)","v":""},{"$f":"IF(B46=0,\"\",Daten!B$16)","v":""},{"$f":"IF(B46=0,\"\",IF(Daten!B$1=TRUE,Daten!B$17,\"-\"))","v":""},{"$f":"IF(B46=0,\"\",IF(C46=\"Nein\",\"-\",Daten!D$7))","v":""},{"$f":"IF(B46=\"\",\"\",IF(C46=\"Nein\",\"-\",IF(T$1=0,\"\",Daten!D$12)))","v":""},{"$f":"IF(B46=\"\",\"\",IF(C46=\"Nein\",\"-\",IF(T$1=0,\"\",Daten!D$13)))","v":""},{"$f":"IF(B46=\"\",\"\",IF(C46=\"Nein\",\"-\",IF(T$1=0,\"\",IF(AK46=\"\",\"\",AK46+X46-Daten!D$20))))","v":""},{"$f":"IF(B46=0,\"\",IF(L$1=1,M46+N46,Daten!D$2))","v":""},{"$f":"IF(B46=0,\"\",IF(C46=\"Nein\",\"-\",Daten!D$6))","v":""},{"$f":"IF(B46=0,\"\",IF(C46=\"Nein\",\"-\",Daten!D$3))","v":""},{"$f":"IF(B46=0,\"\",Daten!D$4)","v":""},{"$f":"IF(B46=0,\"\",IF(C46=\"Nein\",\"-\",Daten!D$5))","v":""},{"$f":"IF(B46=0,\"\",IF(Daten!F$1=\"Keine\",Daten!A$45,IF(Daten!F$7=TRUE,Daten!A$48,Daten!A$44)))","v":""},{"$f":"IF(B46=0,\"\",IF(AB46=\"Standard\",IF(Daten!F$9=TRUE,1,0),0))","v":""},"",{"$f":"IF(B46=0,\"\",IF(OR(AB46=Daten!A$46,AB46=Daten!A$47,AB46=Daten!A$48),AI46+W46,\"-\"))","v":""},{"$f":"IF(B46=0,\"\",IF(AB46=Daten!A$45,\"-\",Daten!F$5))","v":""},{"$f":"IF(B46=0,\"\",IF(AB46=Daten!A$45,\"-\",Daten!F$4))","v":""},{"$f":"IF(B46=0,\"\",IF(AB46=Daten!A$45,\"-\",Daten!F$6))","v":""},{"$f":"IF(B46=0,\"\",IF(AB46=Daten!A$45,\"-\",Daten!F$2))","v":""},{"$f":"IF(B46=0,\"\",IF(AB46=Daten!A$45,\"-\",Daten!F$3))","v":""},"",{"$f":"IF(B46=0,\"\",IF(OR(C46=\"Nein\",Daten!D48=\"Ohne\"),\"-\",Daten!D$9))","v":""},{"$f":"IF(B46=0,\"\",IF(OR(C46=\"Nein\",Daten!D48=\"Ohne\"),\"-\",IF(Daten!D$8=\"Rahmendämmung\",Daten!D$10,\"-\")))","v":""},{"$f":"IF(B46=0,\"\",IF(AND(C46=\"Ja\",Daten!D$15=TRUE),Daten!D$16,\"-\"))","v":""},{"$f":"IF(AN46=\"\",\"\",IF(AND(C46=\"Ja\",Daten!D$15=TRUE),Daten!D$18,\"-\"))","v":""},{"$f":"IF(B46=0,\"\",IF(Daten!H$7=TRUE,\"bauseits\",IF(Daten!H$8=TRUE,\"FSP 40\",\"WSP 40\")))","v":""},{"$f":"IF(B46=0,\"\",Daten!H$10)","v":""},{"$f":"IFERROR(IF(B46=0,\"\",IF(Daten!H$2=TRUE,1,0)*IF(J46+P46+P46+Q46+Q46>Daten!B$62,0,1)*IF(K46+P46+Z46+AF46+10>Daten!B$62,0,1)),0)","v":""}]
[null,null,{"$f":"IF(A47=\"\",\"\",IF(Daten!D$1<>\"Keine\",\"Ja\",\"Nein\"))","v":""},{"$f":"IF(A47=\"\",\"\",IF(Daten!B$4=TRUE,\"QB\",\"BS\")&IF(AR47=1,\"G\",\"\")&IF(C47=\"Nein\",\"-V\",IF(Daten!D$11=TRUE,\"-S\",\"-H\"))&IF(Daten!B$1=TRUE,\"-E\",\"\")&IF(Daten!F$9=TRUE,\"-B\",\"\")&IF(Daten!F$8=TRUE,\"A\",\"\"))","v":""},{"$f":"IF(A47=\"\",\"\",IFERROR(VLOOKUP(D47,Daten!D$43:G$94,2,FALSE),\"spez.\"))","v":""},null,null,null,null,{"$f":"IF(F47<>\"\",F47+(2*(Daten!B$13+2)),IF(H47<>\"\",H47-10,\"\"))","v":""},{"$f":"IFERROR(IF(G47<>\"\",G47+Daten!B$14+Daten!B$15+2+IF(AG47=\"-\",0,AG47),IF(I47<>\"\",I47-5,\"\")),\"\")","v":""},{"$f":"IF(B47=0,\"\",IF(L$1=0,0,Daten!B$10))","v":""},{"$f":"IF(B47=0,\"\",IF(M$1=0,0,Daten!B$11))","v":""},{"$f":"IF(B47=0,\"\",IF(N$1=0,0,Daten!B$12))","v":""},"",{"$f":"IF(B47=0,\"\",Daten!B$6)","v":""},{"$f":"IF(B47=0,\"\",Daten!B$16)","v":""},{"$f":"IF(B47=0,\"\",IF(Daten!B$1=TRUE,Daten!B$17,\"-\"))","v":""},{"$f":"IF(B47=0,\"\",IF(C47=\"Nein\",\"-\",Daten!D$7))","v":""},{"$f":"IF(B47=\"\",\"\",IF(C47=\"Nein\",\"-\",IF(T$1=0,\"\",Daten!D$12)))","v":""},{"$f":"IF(B47=\"\",\"\",IF(C47=\"Nein\",\"-\",IF(T$1=0,\"\",Daten!D$13)))","v":""},{"$f":"IF(B47=\"\",\"\",IF(C47=\"Nein\",\"-\",IF(T$1=0,\"\",IF(AK47=\"\",\"\",AK47+X47-Daten!D$20))))","v":""},{"$f":"IF(B47=0,\"\",IF(L$1=1,M47+N47,Daten!D$2))","v":""},{"$f":"IF(B47=0,\"\",IF(C47=\"Nein\",\"-\",Daten!D$6))","v":""},{"$f":"IF(B47=0,\"\",IF(C47=\"Nein\",\"-\",Daten!D$3))","v":""},{"$f":"IF(B47=0,\"\",Daten!D$4)","v":""},{"$f":"IF(B47=0,\"\",IF(C47=\"Nein\",\"-\",Daten!D$5))","v":""},{"$f":"IF(B47=0,\"\",IF(Daten!F$1=\"Keine\",Daten!A$45,IF(Daten!F$7=TRUE,Daten!A$48,Daten!A$44)))","v":""},{"$f":"IF(B47=0,\"\",IF(AB47=\"Standard\",IF(Daten!F$9=TRUE,1,0),0))","v":""},"",{"$f":"IF(B47=0,\"\",IF(OR(AB47=Daten!A$46,AB47=Daten!A$47,AB47=Daten!A$48),AI47+W47,\"-\"))","v":""},{"$f":"IF(B47=0,\"\",IF(AB47=Daten!A$45,\"-\",Daten!F$5))","v":""},{"$f":"IF(B47=0,\"\",IF(AB47=Daten!A$45,\"-\",Daten!F$4))","v":""},{"$f":"IF(B47=0,\"\",IF(AB47=Daten!A$45,\"-\",Daten!F$6))","v":""},{"$f":"IF(B47=0,\"\",IF(AB47=Daten!A$45,\"-\",Daten!F$2))","v":""},{"$f":"IF(B47=0,\"\",IF(AB47=Daten!A$45,\"-\",Daten!F$3))","v":""},"",{"$f":"IF(B47=0,\"\",IF(OR(C47=\"Nein\",Daten!D49=\"Ohne\"),\"-\",Daten!D$9))","v":""},{"$f":"IF(B47=0,\"\",IF(OR(C47=\"Nein\",Daten!D49=\"Ohne\"),\"-\",IF(Daten!D$8=\"Rahmendämmung\",Daten!D$10,\"-\")))","v":""},{"$f":"IF(B47=0,\"\",IF(AND(C47=\"Ja\",Daten!D$15=TRUE),Daten!D$16,\"-\"))","v":""},{"$f":"IF(AN47=\"\",\"\",IF(AND(C47=\"Ja\",Daten!D$15=TRUE),Daten!D$18,\"-\"))","v":""},{"$f":"IF(B47=0,\"\",IF(Daten!H$7=TRUE,\"bauseits\",IF(Daten!H$8=TRUE,\"FSP 40\",\"WSP 40\")))","v":""},{"$f":"IF(B47=0,\"\",Daten!H$10)","v":""},{"$f":"IFERROR(IF(B47=0,\"\",IF(Daten!H$2=TRUE,1,0)*IF(J47+P47+P47+Q47+Q47>Daten!B$62,0,1)*IF(K47+P47+Z47+AF47+10>Daten!B$62,0,1)),0)","v":""}]
[null,null,{"$f":"IF(A48=\"\",\"\",IF(Daten!D$1<>\"Keine\",\"Ja\",\"Nein\"))","v":""},{"$f":"IF(A48=\"\",\"\",IF(Daten!B$4=TRUE,\"QB\",\"BS\")&IF(AR48=1,\"G\",\"\")&IF(C48=\"Nein\",\"-V\",IF(Daten!D$11=TRUE,\"-S\",\"-H\"))&IF(Daten!B$1=TRUE,\"-E\",\"\")&IF(Daten!F$9=TRUE,\"-B\",\"\")&IF(Daten!F$8=TRUE,\"A\",\"\"))","v":""},{"$f":"IF(A48=\"\",\"\",IFERROR(VLOOKUP(D48,Daten!D$43:G$94,2,FALSE),\"spez.\"))","v":""},null,null,null,null,{"$f":"IF(F48<>\"\",F48+(2*(Daten!B$13+2)),IF(H48<>\"\",H48-10,\"\"))","v":""},{"$f":"IFERROR(IF(G48<>\"\",G48+Daten!B$14+Daten!B$15+2+IF(AG48=\"-\",0,AG48),IF(I48<>\"\",I48-5,\"\")),\"\")","v":""},{"$f":"IF(B48=0,\"\",IF(L$1=0,0,Daten!B$10))","v":""},{"$f":"IF(B48=0,\"\",IF(M$1=0,0,Daten!B$11))","v":""},{"$f":"IF(B48=0,\"\",IF(N$1=0,0,Daten!B$12))","v":""},"",{"$f":"IF(B48=0,\"\",Daten!B$6)","v":""},{"$f":"IF(B48=0,\"\",Daten!B$16)","v":""},{"$f":"IF(B48=0,\"\",IF(Daten!B$1=TRUE,Daten!B$17,\"-\"))","v":""},{"$f":"IF(B48=0,\"\",IF(C48=\"Nein\",\"-\",Daten!D$7))","v":""},{"$f":"IF(B48=\"\",\"\",IF(C48=\"Nein\",\"-\",IF(T$1=0,\"\",Daten!D$12)))","v":""},{"$f":"IF(B48=\"\",\"\",IF(C48=\"Nein\",\"-\",IF(T$1=0,\"\",Daten!D$13)))","v":""},{"$f":"IF(B48=\"\",\"\",IF(C48=\"Nein\",\"-\",IF(T$1=0,\"\",IF(AK48=\"\",\"\",AK48+X48-Daten!D$20))))","v":""},{"$f":"IF(B48=0,\"\",IF(L$1=1,M48+N48,Daten!D$2))","v":""},{"$f":"IF(B48=0,\"\",IF(C48=\"Nein\",\"-\",Daten!D$6))","v":""},{"$f":"IF(B48=0,\"\",IF(C48=\"Nein\",\"-\",Daten!D$3))","v":""},{"$f":"IF(B48=0,\"\",Daten!D$4)","v":""},{"$f":"IF(B48=0,\"\",IF(C48=\"Nein\",\"-\",Daten!D$5))","v":""},{"$f":"IF(B48=0,\"\",IF(Daten!F$1=\"Keine\",Daten!A$45,IF(Daten!F$7=TRUE,Daten!A$48,Daten!A$44)))","v":""},{"$f":"IF(B48=0,\"\",IF(AB48=\"Standard\",IF(Daten!F$9=TRUE,1,0),0))","v":""},"",{"$f":"IF(B48=0,\"\",IF(OR(AB48=Daten!A$46,AB48=Daten!A$47,AB48=Daten!A$48),AI48+W48,\"-\"))","v":""},{"$f":"IF(B48=0,\"\",IF(AB48=Daten!A$45,\"-\",Daten!F$5))","v":""},{"$f":"IF(B48=0,\"\",IF(AB48=Daten!A$45,\"-\",Daten!F$4))","v":""},{"$f":"IF(B48=0,\"\",IF(AB48=Daten!A$45,\"-\",Daten!F$6))","v":""},{"$f":"IF(B48=0,\"\",IF(AB48=Daten!A$45,\"-\",Daten!F$2))","v":""},{"$f":"IF(B48=0,\"\",IF(AB48=Daten!A$45,\"-\",Daten!F$3))","v":""},"",{"$f":"IF(B48=0,\"\",IF(OR(C48=\"Nein\",Daten!D50=\"Ohne\"),\"-\",Daten!D$9))","v":""},{"$f":"IF(B48=0,\"\",IF(OR(C48=\"Nein\",Daten!D50=\"Ohne\"),\"-\",IF(Daten!D$8=\"Rahmendämmung\",Daten!D$10,\"-\")))","v":""},{"$f":"IF(B48=0,\"\",IF(AND(C48=\"Ja\",Daten!D$15=TRUE),Daten!D$16,\"-\"))","v":""},{"$f":"IF(AN48=\"\",\"\",IF(AND(C48=\"Ja\",Daten!D$15=TRUE),Daten!D$18,\"-\"))","v":""},{"$f":"IF(B48=0,\"\",IF(Daten!H$7=TRUE,\"bauseits\",IF(Daten!H$8=TRUE,\"FSP 40\",\"WSP 40\")))","v":""},{"$f":"IF(B48=0,\"\",Daten!H$10)","v":""},{"$f":"IFERROR(IF(B48=0,\"\",IF(Daten!H$2=TRUE,1,0)*IF(J48+P48+P48+Q48+Q48>Daten!B$62,0,1)*IF(K48+P48+Z48+AF48+10>Daten!B$62,0,1)),0)","v":""}]
[null,null,{"$f":"IF(A49=\"\",\"\",IF(Daten!D$1<>\"Keine\",\"Ja\",\"Nein\"))","v":""},{"$f":"IF(A49=\"\",\"\",IF(Daten!B$4=TRUE,\"QB\",\"BS\")&IF(AR49=1,\"G\",\"\")&IF(C49=\"Nein\",\"-V\",IF(Daten!D$11=TRUE,\"-S\",\"-H\"))&IF(Daten!B$1=TRUE,\"-E\",\"\")&IF(Daten!F$9=TRUE,\"-B\",\"\")&IF(Daten!F$8=TRUE,\"A\",\"\"))","v":""},{"$f":"IF(A49=\"\",\"\",IFERROR(VLOOKUP(D49,Daten!D$43:G$94,2,FALSE),\"spez.\"))","v":""},null,null,null,null,{"$f":"IF(F49<>\"\",F49+(2*(Daten!B$13+2)),IF(H49<>\"\",H49-10,\"\"))","v":""},{"$f":"IFERROR(IF(G49<>\"\",G49+Daten!B$14+Daten!B$15+2+IF(AG49=\"-\",0,AG49),IF(I49<>\"\",I49-5,\"\")),\"\")","v":""},{"$f":"IF(B49=0,\"\",IF(L$1=0,0,Daten!B$10))","v":""},{"$f":"IF(B49=0,\"\",IF(M$1=0,0,Daten!B$11))","v":""},{"$f":"IF(B49=0,\"\",IF(N$1=0,0,Daten!B$12))","v":""},"",{"$f":"IF(B49=0,\"\",Daten!B$6)","v":""},{"$f":"IF(B49=0,\"\",Daten!B$16)","v":""},{"$f":"IF(B49=0,\"\",IF(Daten!B$1=TRUE,Daten!B$17,\"-\"))","v":""},{"$f":"IF(B49=0,\"\",IF(C49=\"Nein\",\"-\",Daten!D$7))","v":""},{"$f":"IF(B49=\"\",\"\",IF(C49=\"Nein\",\"-\",IF(T$1=0,\"\",Daten!D$12)))","v":""},{"$f":"IF(B49=\"\",\"\",IF(C49=\"Nein\",\"-\",IF(T$1=0,\"\",Daten!D$13)))","v":""},{"$f":"IF(B49=\"\",\"\",IF(C49=\"Nein\",\"-\",IF(T$1=0,\"\",IF(AK49=\"\",\"\",AK49+X49-Daten!D$20))))","v":""},{"$f":"IF(B49=0,\"\",IF(L$1=1,M49+N49,Daten!D$2))","v":""},{"$f":"IF(B49=0,\"\",IF(C49=\"Nein\",\"-\",Daten!D$6))","v":""},{"$f":"IF(B49=0,\"\",IF(C49=\"Nein\",\"-\",Daten!D$3))","v":""},{"$f":"IF(B49=0,\"\",Daten!D$4)","v":""},{"$f":"IF(B49=0,\"\",IF(C49=\"Nein\",\"-\",Daten!D$5))","v":""},{"$f":"IF(B49=0,\"\",IF(Daten!F$1=\"Keine\",Daten!A$45,IF(Daten!F$7=TRUE,Daten!A$48,Daten!A$44)))","v":""},{"$f":"IF(B49=0,\"\",IF(AB49=\"Standard\",IF(Daten!F$9=TRUE,1,0),0))","v":""},"",{"$f":"IF(B49=0,\"\",IF(OR(AB49=Daten!A$46,AB49=Daten!A$47,AB49=Daten!A$48),AI49+W49,\"-\"))","v":""},{"$f":"IF(B49=0,\"\",IF(AB49=Daten!A$45,\"-\",Daten!F$5))","v":""},{"$f":"IF(B49=0,\"\",IF(AB49=Daten!A$45,\"-\",Daten!F$4))","v":""},{"$f":"IF(B49=0,\"\",IF(AB49=Daten!A$45,\"-\",Daten!F$6))","v":""},{"$f":"IF(B49=0,\"\",IF(AB49=Daten!A$45,\"-\",Daten!F$2))","v":""},{"$f":"IF(B49=0,\"\",IF(AB49=Daten!A$45,\"-\",Daten!F$3))","v":""},"",{"$f":"IF(B49=0,\"\",IF(OR(C49=\"Nein\",Daten!#REF!=\"Ohne\"),\"-\",Daten!D$9))","v":""},{"$f":"IF(B49=0,\"\",IF(OR(C49=\"Nein\",Daten!#REF!=\"Ohne\"),\"-\",IF(Daten!D$8=\"Rahmendämmung\",Daten!D$10,\"-\")))","v":""},{"$f":"IF(B49=0,\"\",IF(AND(C49=\"Ja\",Daten!D$15=TRUE),Daten!D$16,\"-\"))","v":""},{"$f":"IF(AN49=\"\",\"\",IF(AND(C49=\"Ja\",Daten!D$15=TRUE),Daten!D$18,\"-\"))","v":""},{"$f":"IF(B49=0,\"\",IF(Daten!H$7=TRUE,\"bauseits\",IF(Daten!H$8=TRUE,\"FSP 40\",\"WSP 40\")))","v":""},{"$f":"IF(B49=0,\"\",Daten!H$10)","v":""},{"$f":"IFERROR(IF(B49=0,\"\",IF(Daten!H$2=TRUE,1,0)*IF(J49+P49+P49+Q49+Q49>Daten!B$62,0,1)*IF(K49+P49+Z49+AF49+10>Daten!B$62,0,1)),0)","v":""}]
[null,null,{"$f":"IF(A50=\"\",\"\",IF(Daten!D$1<>\"Keine\",\"Ja\",\"Nein\"))","v":""},{"$f":"IF(A50=\"\",\"\",IF(Daten!B$4=TRUE,\"QB\",\"BS\")&IF(AR50=1,\"G\",\"\")&IF(C50=\"Nein\",\"-V\",IF(Daten!D$11=TRUE,\"-S\",\"-H\"))&IF(Daten!B$1=TRUE,\"-E\",\"\")&IF(Daten!F$9=TRUE,\"-B\",\"\")&IF(Daten!F$8=TRUE,\"A\",\"\"))","v":""},{"$f":"IF(A50=\"\",\"\",IFERROR(VLOOKUP(D50,Daten!D$43:G$94,2,FALSE),\"spez.\"))","v":""},null,null,null,null,{"$f":"IF(F50<>\"\",F50+(2*(Daten!B$13+2)),IF(H50<>\"\",H50-10,\"\"))","v":""},{"$f":"IFERROR(IF(G50<>\"\",G50+Daten!B$14+Daten!B$15+2+IF(AG50=\"-\",0,AG50),IF(I50<>\"\",I50-5,\"\")),\"\")","v":""},{"$f":"IF(B50=0,\"\",IF(L$1=0,0,Daten!B$10))","v":""},{"$f":"IF(B50=0,\"\",IF(M$1=0,0,Daten!B$11))","v":""},{"$f":"IF(B50=0,\"\",IF(N$1=0,0,Daten!B$12))","v":""},"",{"$f":"IF(B50=0,\"\",Daten!B$6)","v":""},{"$f":"IF(B50=0,\"\",Daten!B$16)","v":""},{"$f":"IF(B50=0,\"\",IF(Daten!B$1=TRUE,Daten!B$17,\"-\"))","v":""},{"$f":"IF(B50=0,\"\",IF(C50=\"Nein\",\"-\",Daten!D$7))","v":""},{"$f":"IF(B50=\"\",\"\",IF(C50=\"Nein\",\"-\",IF(T$1=0,\"\",Daten!D$12)))","v":""},{"$f":"IF(B50=\"\",\"\",IF(C50=\"Nein\",\"-\",IF(T$1=0,\"\",Daten!D$13)))","v":""},{"$f":"IF(B50=\"\",\"\",IF(C50=\"Nein\",\"-\",IF(T$1=0,\"\",IF(AK50=\"\",\"\",AK50+X50-Daten!D$20))))","v":""},{"$f":"IF(B50=0,\"\",IF(L$1=1,M50+N50,Daten!D$2))","v":""},{"$f":"IF(B50=0,\"\",IF(C50=\"Nein\",\"-\",Daten!D$6))","v":""},{"$f":"IF(B50=0,\"\",IF(C50=\"Nein\",\"-\",Daten!D$3))","v":""},{"$f":"IF(B50=0,\"\",Daten!D$4)","v":""},{"$f":"IF(B50=0,\"\",IF(C50=\"Nein\",\"-\",Daten!D$5))","v":""},{"$f":"IF(B50=0,\"\",IF(Daten!F$1=\"Keine\",Daten!A$45,IF(Daten!F$7=TRUE,Daten!A$48,Daten!A$44)))","v":""},{"$f":"IF(B50=0,\"\",IF(AB50=\"Standard\",IF(Daten!F$9=TRUE,1,0),0))","v":""},"",{"$f":"IF(B50=0,\"\",IF(OR(AB50=Daten!A$46,AB50=Daten!A$47,AB50=Daten!A$48),AI50+W50,\"-\"))","v":""},{"$f":"IF(B50=0,\"\",IF(AB50=Daten!A$45,\"-\",Daten!F$5))","v":""},{"$f":"IF(B50=0,\"\",IF(AB50=Daten!A$45,\"-\",Daten!F$4))","v":""},{"$f":"IF(B50=0,\"\",IF(AB50=Daten!A$45,\"-\",Daten!F$6))","v":""},{"$f":"IF(B50=0,\"\",IF(AB50=Daten!A$45,\"-\",Daten!F$2))","v":""},{"$f":"IF(B50=0,\"\",IF(AB50=Daten!A$45,\"-\",Daten!F$3))","v":""},"",{"$f":"IF(B50=0,\"\",IF(OR(C50=\"Nein\",Daten!#REF!=\"Ohne\"),\"-\",Daten!D$9))","v":""},{"$f":"IF(B50=0,\"\",IF(OR(C50=\"Nein\",Daten!#REF!=\"Ohne\"),\"-\",IF(Daten!D$8=\"Rahmendämmung\",Daten!D$10,\"-\")))","v":""},{"$f":"IF(B50=0,\"\",IF(AND(C50=\"Ja\",Daten!D$15=TRUE),Daten!D$16,\"-\"))","v":""},{"$f":"IF(AN50=\"\",\"\",IF(AND(C50=\"Ja\",Daten!D$15=TRUE),Daten!D$18,\"-\"))","v":""},{"$f":"IF(B50=0,\"\",IF(Daten!H$7=TRUE,\"bauseits\",IF(Daten!H$8=TRUE,\"FSP 40\",\"WSP 40\")))","v":""},{"$f":"IF(B50=0,\"\",Daten!H$10)","v":""},{"$f":"IFERROR(IF(B50=0,\"\",IF(Daten!H$2=TRUE,1,0)*IF(J50+P50+P50+Q50+Q50>Daten!B$62,0,1)*IF(K50+P50+Z50+AF50+10>Daten!B$62,0,1)),0)","v":""}]
[null,null,{"$f":"IF(A51=\"\",\"\",IF(Daten!D$1<>\"Keine\",\"Ja\",\"Nein\"))","v":""},{"$f":"IF(A51=\"\",\"\",IF(Daten!B$4=TRUE,\"QB\",\"BS\")&IF(AR51=1,\"G\",\"\")&IF(C51=\"Nein\",\"-V\",IF(Daten!D$11=TRUE,\"-S\",\"-H\"))&IF(Daten!B$1=TRUE,\"-E\",\"\")&IF(Daten!F$9=TRUE,\"-B\",\"\")&IF(Daten!F$8=TRUE,\"A\",\"\"))","v":""},{"$f":"IF(A51=\"\",\"\",IFERROR(VLOOKUP(D51,Daten!D$43:G$94,2,FALSE),\"spez.\"))","v":""},null,null,null,null,{"$f":"IF(F51<>\"\",F51+(2*(Daten!B$13+2)),IF(H51<>\"\",H51-10,\"\"))","v":""},{"$f":"IFERROR(IF(G51<>\"\",G51+Daten!B$14+Daten!B$15+2+IF(AG51=\"-\",0,AG51),IF(I51<>\"\",I51-5,\"\")),\"\")","v":""},{"$f":"IF(B51=0,\"\",IF(L$1=0,0,Daten!B$10))","v":""},{"$f":"IF(B51=0,\"\",IF(M$1=0,0,Daten!B$11))","v":""},{"$f":"IF(B51=0,\"\",IF(N$1=0,0,Daten!B$12))","v":""},"",{"$f":"IF(B51=0,\"\",Daten!B$6)","v":""},{"$f":"IF(B51=0,\"\",Daten!B$16)","v":""},{"$f":"IF(B51=0,\"\",IF(Daten!B$1=TRUE,Daten!B$17,\"-\"))","v":""},{"$f":"IF(B51=0,\"\",IF(C51=\"Nein\",\"-\",Daten!D$7))","v":""},{"$f":"IF(B51=\"\",\"\",IF(C51=\"Nein\",\"-\",IF(T$1=0,\"\",Daten!D$12)))","v":""},{"$f":"IF(B51=\"\",\"\",IF(C51=\"Nein\",\"-\",IF(T$1=0,\"\",Daten!D$13)))","v":""},{"$f":"IF(B51=\"\",\"\",IF(C51=\"Nein\",\"-\",IF(T$1=0,\"\",IF(AK51=\"\",\"\",AK51+X51-Daten!D$20))))","v":""},{"$f":"IF(B51=0,\"\",IF(L$1=1,M51+N51,Daten!D$2))","v":""},{"$f":"IF(B51=0,\"\",IF(C51=\"Nein\",\"-\",Daten!D$6))","v":""},{"$f":"IF(B51=0,\"\",IF(C51=\"Nein\",\"-\",Daten!D$3))","v":""},{"$f":"IF(B51=0,\"\",Daten!D$4)","v":""},{"$f":"IF(B51=0,\"\",IF(C51=\"Nein\",\"-\",Daten!D$5))","v":""},{"$f":"IF(B51=0,\"\",IF(Daten!F$1=\"Keine\",Daten!A$45,IF(Daten!F$7=TRUE,Daten!A$48,Daten!A$44)))","v":""},{"$f":"IF(B51=0,\"\",IF(AB51=\"Standard\",IF(Daten!F$9=TRUE,1,0),0))","v":""},"",{"$f":"IF(B51=0,\"\",IF(OR(AB51=Daten!A$46,AB51=Daten!A$47,AB51=Daten!A$48),AI51+W51,\"-\"))","v":""},{"$f":"IF(B51=0,\"\",IF(AB51=Daten!A$45,\"-\",Daten!F$5))","v":""},{"$f":"IF(B51=0,\"\",IF(AB51=Daten!A$45,\"-\",Daten!F$4))","v":""},{"$f":"IF(B51=0,\"\",IF(AB51=Daten!A$45,\"-\",Daten!F$6))","v":""},{"$f":"IF(B51=0,\"\",IF(AB51=Daten!A$45,\"-\",Daten!F$2))","v":""},{"$f":"IF(B51=0,\"\",IF(AB51=Daten!A$45,\"-\",Daten!F$3))","v":""},"",{"$f":"IF(B51=0,\"\",IF(OR(C51=\"Nein\",Daten!#REF!=\"Ohne\"),\"-\",Daten!D$9))","v":""},{"$f":"IF(B51=0,\"\",IF(OR(C51=\"Nein\",Daten!#REF!=\"Ohne\"),\"-\",IF(Daten!D$8=\"Rahmendämmung\",Daten!D$10,\"-\")))","v":""},{"$f":"IF(B51=0,\"\",IF(AND(C51=\"Ja\",Daten!D$15=TRUE),Daten!D$16,\"-\"))","v":""},{"$f":"IF(AN51=\"\",\"\",IF(AND(C51=\"Ja\",Daten!D$15=TRUE),Daten!D$18,\"-\"))","v":""},{"$f":"IF(B51=0,\"\",IF(Daten!H$7=TRUE,\"bauseits\",IF(Daten!H$8=TRUE,\"FSP 40\",\"WSP 40\")))","v":""},{"$f":"IF(B51=0,\"\",Daten!H$10)","v":""},{"$f":"IFERROR(IF(B51=0,\"\",IF(Daten!H$2=TRUE,1,0)*IF(J51+P51+P51+Q51+Q51>Daten!B$62,0,1)*IF(K51+P51+Z51+AF51+10>Daten!B$62,0,1)),0)","v":""}]
[null,null,{"$f":"IF(A52=\"\",\"\",IF(Daten!D$1<>\"Keine\",\"Ja\",\"Nein\"))","v":""},{"$f":"IF(A52=\"\",\"\",IF(Daten!B$4=TRUE,\"QB\",\"BS\")&IF(AR52=1,\"G\",\"\")&IF(C52=\"Nein\",\"-V\",IF(Daten!D$11=TRUE,\"-S\",\"-H\"))&IF(Daten!B$1=TRUE,\"-E\",\"\")&IF(Daten!F$9=TRUE,\"-B\",\"\")&IF(Daten!F$8=TRUE,\"A\",\"\"))","v":""},{"$f":"IF(A52=\"\",\"\",IFERROR(VLOOKUP(D52,Daten!D$43:G$94,2,FALSE),\"spez.\"))","v":""},null,null,null,null,{"$f":"IF(F52<>\"\",F52+(2*(Daten!B$13+2)),IF(H52<>\"\",H52-10,\"\"))","v":""},{"$f":"IFERROR(IF(G52<>\"\",G52+Daten!B$14+Daten!B$15+2+IF(AG52=\"-\",0,AG52),IF(I52<>\"\",I52-5,\"\")),\"\")","v":""},{"$f":"IF(B52=0,\"\",IF(L$1=0,0,Daten!B$10))","v":""},{"$f":"IF(B52=0,\"\",IF(M$1=0,0,Daten!B$11))","v":""},{"$f":"IF(B52=0,\"\",IF(N$1=0,0,Daten!B$12))","v":""},"",{"$f":"IF(B52=0,\"\",Daten!B$6)","v":""},{"$f":"IF(B52=0,\"\",Daten!B$16)","v":""},{"$f":"IF(B52=0,\"\",IF(Daten!B$1=TRUE,Daten!B$17,\"-\"))","v":""},{"$f":"IF(B52=0,\"\",IF(C52=\"Nein\",\"-\",Daten!D$7))","v":""},{"$f":"IF(B52=\"\",\"\",IF(C52=\"Nein\",\"-\",IF(T$1=0,\"\",Daten!D$12)))","v":""},{"$f":"IF(B52=\"\",\"\",IF(C52=\"Nein\",\"-\",IF(T$1=0,\"\",Daten!D$13)))","v":""},{"$f":"IF(B52=\"\",\"\",IF(C52=\"Nein\",\"-\",IF(T$1=0,\"\",IF(AK52=\"\",\"\",AK52+X52-Daten!D$20))))","v":""},{"$f":"IF(B52=0,\"\",IF(L$1=1,M52+N52,Daten!D$2))","v":""},{"$f":"IF(B52=0,\"\",IF(C52=\"Nein\",\"-\",Daten!D$6))","v":""},{"$f":"IF(B52=0,\"\",IF(C52=\"Nein\",\"-\",Daten!D$3))","v":""},{"$f":"IF(B52=0,\"\",Daten!D$4)","v":""},{"$f":"IF(B52=0,\"\",IF(C52=\"Nein\",\"-\",Daten!D$5))","v":""},{"$f":"IF(B52=0,\"\",IF(Daten!F$1=\"Keine\",Daten!A$45,IF(Daten!F$7=TRUE,Daten!A$48,Daten!A$44)))","v":""},{"$f":"IF(B52=0,\"\",IF(AB52=\"Standard\",IF(Daten!F$9=TRUE,1,0),0))","v":""},"",{"$f":"IF(B52=0,\"\",IF(OR(AB52=Daten!A$46,AB52=Daten!A$47,AB52=Daten!A$48),AI52+W52,\"-\"))","v":""},{"$f":"IF(B52=0,\"\",IF(AB52=Daten!A$45,\"-\",Daten!F$5))","v":""},{"$f":"IF(B52=0,\"\",IF(AB52=Daten!A$45,\"-\",Daten!F$4))","v":""},{"$f":"IF(B52=0,\"\",IF(AB52=Daten!A$45,\"-\",Daten!F$6))","v":""},{"$f":"IF(B52=0,\"\",IF(AB52=Daten!A$45,\"-\",Daten!F$2))","v":""},{"$f":"IF(B52=0,\"\",IF(AB52=Daten!A$45,\"-\",Daten!F$3))","v":""},"",{"$f":"IF(B52=0,\"\",IF(OR(C52=\"Nein\",Daten!#REF!=\"Ohne\"),\"-\",Daten!D$9))","v":""},{"$f":"IF(B52=0,\"\",IF(OR(C52=\"Nein\",Daten!#REF!=\"Ohne\"),\"-\",IF(Daten!D$8=\"Rahmendämmung\",Daten!D$10,\"-\")))","v":""},{"$f":"IF(B52=0,\"\",IF(AND(C52=\"Ja\",Daten!D$15=TRUE),Daten!D$16,\"-\"))","v":""},{"$f":"IF(AN52=\"\",\"\",IF(AND(C52=\"Ja\",Daten!D$15=TRUE),Daten!D$18,\"-\"))","v":""},{"$f":"IF(B52=0,\"\",IF(Daten!H$7=TRUE,\"bauseits\",IF(Daten!H$8=TRUE,\"FSP 40\",\"WSP 40\")))","v":""},{"$f":"IF(B52=0,\"\",Daten!H$10)","v":""},{"$f":"IFERROR(IF(B52=0,\"\",IF(Daten!H$2=TRUE,1,0)*IF(J52+P52+P52+Q52+Q52>Daten!B$62,0,1)*IF(K52+P52+Z52+AF52+10>Daten!B$62,0,1)),0)","v":""}]
[null,null,{"$f":"IF(A53=\"\",\"\",IF(Daten!D$1<>\"Keine\",\"Ja\",\"Nein\"))","v":""},{"$f":"IF(A53=\"\",\"\",IF(Daten!B$4=TRUE,\"QB\",\"BS\")&IF(AR53=1,\"G\",\"\")&IF(C53=\"Nein\",\"-V\",IF(Daten!D$11=TRUE,\"-S\",\"-H\"))&IF(Daten!B$1=TRUE,\"-E\",\"\")&IF(Daten!F$9=TRUE,\"-B\",\"\")&IF(Daten!F$8=TRUE,\"A\",\"\"))","v":""},{"$f":"IF(A53=\"\",\"\",IFERROR(VLOOKUP(D53,Daten!D$43:G$94,2,FALSE),\"spez.\"))","v":""},null,null,null,null,{"$f":"IF(F53<>\"\",F53+(2*(Daten!B$13+2)),IF(H53<>\"\",H53-10,\"\"))","v":""},{"$f":"IFERROR(IF(G53<>\"\",G53+Daten!B$14+Daten!B$15+2+IF(AG53=\"-\",0,AG53),IF(I53<>\"\",I53-5,\"\")),\"\")","v":""},{"$f":"IF(B53=0,\"\",IF(L$1=0,0,Daten!B$10))","v":""},{"$f":"IF(B53=0,\"\",IF(M$1=0,0,Daten!B$11))","v":""},{"$f":"IF(B53=0,\"\",IF(N$1=0,0,Daten!B$12))","v":""},"",{"$f":"IF(B53=0,\"\",Daten!B$6)","v":""},{"$f":"IF(B53=0,\"\",Daten!B$16)","v":""},{"$f":"IF(B53=0,\"\",IF(Daten!B$1=TRUE,Daten!B$17,\"-\"))","v":""},{"$f":"IF(B53=0,\"\",IF(C53=\"Nein\",\"-\",Daten!D$7))","v":""},{"$f":"IF(B53=\"\",\"\",IF(C53=\"Nein\",\"-\",IF(T$1=0,\"\",Daten!D$12)))","v":""},{"$f":"IF(B53=\"\",\"\",IF(C53=\"Nein\",\"-\",IF(T$1=0,\"\",Daten!D$13)))","v":""},{"$f":"IF(B53=\"\",\"\",IF(C53=\"Nein\",\"-\",IF(T$1=0,\"\",IF(AK53=\"\",\"\",AK53+X53-Daten!D$20))))","v":""},{"$f":"IF(B53=0,\"\",IF(L$1=1,M53+N53,Daten!D$2))","v":""},{"$f":"IF(B53=0,\"\",IF(C53=\"Nein\",\"-\",Daten!D$6))","v":""},{"$f":"IF(B53=0,\"\",IF(C53=\"Nein\",\"-\",Daten!D$3))","v":""},{"$f":"IF(B53=0,\"\",Daten!D$4)","v":""},{"$f":"IF(B53=0,\"\",IF(C53=\"Nein\",\"-\",Daten!D$5))","v":""},{"$f":"IF(B53=0,\"\",IF(Daten!F$1=\"Keine\",Daten!A$45,IF(Daten!F$7=TRUE,Daten!A$48,Daten!A$44)))","v":""},{"$f":"IF(B53=0,\"\",IF(AB53=\"Standard\",IF(Daten!F$9=TRUE,1,0),0))","v":""},"",{"$f":"IF(B53=0,\"\",IF(OR(AB53=Daten!A$46,AB53=Daten!A$47,AB53=Daten!A$48),AI53+W53,\"-\"))","v":""},{"$f":"IF(B53=0,\"\",IF(AB53=Daten!A$45,\"-\",Daten!F$5))","v":""},{"$f":"IF(B53=0,\"\",IF(AB53=Daten!A$45,\"-\",Daten!F$4))","v":""},{"$f":"IF(B53=0,\"\",IF(AB53=Daten!A$45,\"-\",Daten!F$6))","v":""},{"$f":"IF(B53=0,\"\",IF(AB53=Daten!A$45,\"-\",Daten!F$2))","v":""},{"$f":"IF(B53=0,\"\",IF(AB53=Daten!A$45,\"-\",Daten!F$3))","v":""},"",{"$f":"IF(B53=0,\"\",IF(OR(C53=\"Nein\",Daten!#REF!=\"Ohne\"),\"-\",Daten!D$9))","v":""},{"$f":"IF(B53=0,\"\",IF(OR(C53=\"Nein\",Daten!#REF!=\"Ohne\"),\"-\",IF(Daten!D$8=\"Rahmendämmung\",Daten!D$10,\"-\")))","v":""},{"$f":"IF(B53=0,\"\",IF(AND(C53=\"Ja\",Daten!D$15=TRUE),Daten!D$16,\"-\"))","v":""},{"$f":"IF(AN53=\"\",\"\",IF(AND(C53=\"Ja\",Daten!D$15=TRUE),Daten!D$18,\"-\"))","v":""},{"$f":"IF(B53=0,\"\",IF(Daten!H$7=TRUE,\"bauseits\",IF(Daten!H$8=TRUE,\"FSP 40\",\"WSP 40\")))","v":""},{"$f":"IF(B53=0,\"\",Daten!H$10)","v":""},{"$f":"IFERROR(IF(B53=0,\"\",IF(Daten!H$2=TRUE,1,0)*IF(J53+P53+P53+Q53+Q53>Daten!B$62,0,1)*IF(K53+P53+Z53+AF53+10>Daten!B$62,0,1)),0)","v":""}]
[null,null,{"$f":"IF(A54=\"\",\"\",IF(Daten!D$1<>\"Keine\",\"Ja\",\"Nein\"))","v":""},{"$f":"IF(A54=\"\",\"\",IF(Daten!B$4=TRUE,\"QB\",\"BS\")&IF(AR54=1,\"G\",\"\")&IF(C54=\"Nein\",\"-V\",IF(Daten!D$11=TRUE,\"-S\",\"-H\"))&IF(Daten!B$1=TRUE,\"-E\",\"\")&IF(Daten!F$9=TRUE,\"-B\",\"\")&IF(Daten!F$8=TRUE,\"A\",\"\"))","v":""},{"$f":"IF(A54=\"\",\"\",IFERROR(VLOOKUP(D54,Daten!D$43:G$94,2,FALSE),\"spez.\"))","v":""},null,null,null,null,{"$f":"IF(F54<>\"\",F54+(2*(Daten!B$13+2)),IF(H54<>\"\",H54-10,\"\"))","v":""},{"$f":"IFERROR(IF(G54<>\"\",G54+Daten!B$14+Daten!B$15+2+IF(AG54=\"-\",0,AG54),IF(I54<>\"\",I54-5,\"\")),\"\")","v":""},{"$f":"IF(B54=0,\"\",IF(L$1=0,0,Daten!B$10))","v":""},{"$f":"IF(B54=0,\"\",IF(M$1=0,0,Daten!B$11))","v":""},{"$f":"IF(B54=0,\"\",IF(N$1=0,0,Daten!B$12))","v":""},"",{"$f":"IF(B54=0,\"\",Daten!B$6)","v":""},{"$f":"IF(B54=0,\"\",Daten!B$16)","v":""},{"$f":"IF(B54=0,\"\",IF(Daten!B$1=TRUE,Daten!B$17,\"-\"))","v":""},{"$f":"IF(B54=0,\"\",IF(C54=\"Nein\",\"-\",Daten!D$7))","v":""},{"$f":"IF(B54=\"\",\"\",IF(C54=\"Nein\",\"-\",IF(T$1=0,\"\",Daten!D$12)))","v":""},{"$f":"IF(B54=\"\",\"\",IF(C54=\"Nein\",\"-\",IF(T$1=0,\"\",Daten!D$13)))","v":""},{"$f":"IF(B54=\"\",\"\",IF(C54=\"Nein\",\"-\",IF(T$1=0,\"\",IF(AK54=\"\",\"\",AK54+X54-Daten!D$20))))","v":""},{"$f":"IF(B54=0,\"\",IF(L$1=1,M54+N54,Daten!D$2))","v":""},{"$f":"IF(B54=0,\"\",IF(C54=\"Nein\",\"-\",Daten!D$6))","v":""},{"$f":"IF(B54=0,\"\",IF(C54=\"Nein\",\"-\",Daten!D$3))","v":""},{"$f":"IF(B54=0,\"\",Daten!D$4)","v":""},{"$f":"IF(B54=0,\"\",IF(C54=\"Nein\",\"-\",Daten!D$5))","v":""},{"$f":"IF(B54=0,\"\",IF(Daten!F$1=\"Keine\",Daten!A$45,IF(Daten!F$7=TRUE,Daten!A$48,Daten!A$44)))","v":""},{"$f":"IF(B54=0,\"\",IF(AB54=\"Standard\",IF(Daten!F$9=TRUE,1,0),0))","v":""},"",{"$f":"IF(B54=0,\"\",IF(OR(AB54=Daten!A$46,AB54=Daten!A$47,AB54=Daten!A$48),AI54+W54,\"-\"))","v":""},{"$f":"IF(B54=0,\"\",IF(AB54=Daten!A$45,\"-\",Daten!F$5))","v":""},{"$f":"IF(B54=0,\"\",IF(AB54=Daten!A$45,\"-\",Daten!F$4))","v":""},{"$f":"IF(B54=0,\"\",IF(AB54=Daten!A$45,\"-\",Daten!F$6))","v":""},{"$f":"IF(B54=0,\"\",IF(AB54=Daten!A$45,\"-\",Daten!F$2))","v":""},{"$f":"IF(B54=0,\"\",IF(AB54=Daten!A$45,\"-\",Daten!F$3))","v":""},"",{"$f":"IF(B54=0,\"\",IF(OR(C54=\"Nein\",Daten!#REF!=\"Ohne\"),\"-\",Daten!D$9))","v":""},{"$f":"IF(B54=0,\"\",IF(OR(C54=\"Nein\",Daten!#REF!=\"Ohne\"),\"-\",IF(Daten!D$8=\"Rahmendämmung\",Daten!D$10,\"-\")))","v":""},{"$f":"IF(B54=0,\"\",IF(AND(C54=\"Ja\",Daten!D$15=TRUE),Daten!D$16,\"-\"))","v":""},{"$f":"IF(AN54=\"\",\"\",IF(AND(C54=\"Ja\",Daten!D$15=TRUE),Daten!D$18,\"-\"))","v":""},{"$f":"IF(B54=0,\"\",IF(Daten!H$7=TRUE,\"bauseits\",IF(Daten!H$8=TRUE,\"FSP 40\",\"WSP 40\")))","v":""},{"$f":"IF(B54=0,\"\",Daten!H$10)","v":""},{"$f":"IFERROR(IF(B54=0,\"\",IF(Daten!H$2=TRUE,1,0)*IF(J54+P54+P54+Q54+Q54>Daten!B$62,0,1)*IF(K54+P54+Z54+AF54+10>Daten!B$62,0,1)),0)","v":""}]
[null,null,{"$f":"IF(A55=\"\",\"\",IF(Daten!D$1<>\"Keine\",\"Ja\",\"Nein\"))","v":""},{"$f":"IF(A55=\"\",\"\",IF(Daten!B$4=TRUE,\"QB\",\"BS\")&IF(AR55=1,\"G\",\"\")&IF(C55=\"Nein\",\"-V\",IF(Daten!D$11=TRUE,\"-S\",\"-H\"))&IF(Daten!B$1=TRUE,\"-E\",\"\")&IF(Daten!F$9=TRUE,\"-B\",\"\")&IF(Daten!F$8=TRUE,\"A\",\"\"))","v":""},{"$f":"IF(A55=\"\",\"\",IFERROR(VLOOKUP(D55,Daten!D$43:G$94,2,FALSE),\"spez.\"))","v":""},null,null,null,null,{"$f":"IF(F55<>\"\",F55+(2*(Daten!B$13+2)),IF(H55<>\"\",H55-10,\"\"))","v":""},{"$f":"IFERROR(IF(G55<>\"\",G55+Daten!B$14+Daten!B$15+2+IF(AG55=\"-\",0,AG55),IF(I55<>\"\",I55-5,\"\")),\"\")","v":""},{"$f":"IF(B55=0,\"\",IF(L$1=0,0,Daten!B$10))","v":""},{"$f":"IF(B55=0,\"\",IF(M$1=0,0,Daten!B$11))","v":""},{"$f":"IF(B55=0,\"\",IF(N$1=0,0,Daten!B$12))","v":""},"",{"$f":"IF(B55=0,\"\",Daten!B$6)","v":""},{"$f":"IF(B55=0,\"\",Daten!B$16)","v":""},{"$f":"IF(B55=0,\"\",IF(Daten!B$1=TRUE,Daten!B$17,\"-\"))","v":""},{"$f":"IF(B55=0,\"\",IF(C55=\"Nein\",\"-\",Daten!D$7))","v":""},{"$f":"IF(B55=\"\",\"\",IF(C55=\"Nein\",\"-\",IF(T$1=0,\"\",Daten!D$12)))","v":""},{"$f":"IF(B55=\"\",\"\",IF(C55=\"Nein\",\"-\",IF(T$1=0,\"\",Daten!D$13)))","v":""},{"$f":"IF(B55=\"\",\"\",IF(C55=\"Nein\",\"-\",IF(T$1=0,\"\",IF(AK55=\"\",\"\",AK55+X55-Daten!D$20))))","v":""},{"$f":"IF(B55=0,\"\",IF(L$1=1,M55+N55,Daten!D$2))","v":""},{"$f":"IF(B55=0,\"\",IF(C55=\"Nein\",\"-\",Daten!D$6))","v":""},{"$f":"IF(B55=0,\"\",IF(C55=\"Nein\",\"-\",Daten!D$3))","v":""},{"$f":"IF(B55=0,\"\",Daten!D$4)","v":""},{"$f":"IF(B55=0,\"\",IF(C55=\"Nein\",\"-\",Daten!D$5))","v":""},{"$f":"IF(B55=0,\"\",IF(Daten!F$1=\"Keine\",Daten!A$45,IF(Daten!F$7=TRUE,Daten!A$48,Daten!A$44)))","v":""},{"$f":"IF(B55=0,\"\",IF(AB55=\"Standard\",IF(Daten!F$9=TRUE,1,0),0))","v":""},"",{"$f":"IF(B55=0,\"\",IF(OR(AB55=Daten!A$46,AB55=Daten!A$47,AB55=Daten!A$48),AI55+W55,\"-\"))","v":""},{"$f":"IF(B55=0,\"\",IF(AB55=Daten!A$45,\"-\",Daten!F$5))","v":""},{"$f":"IF(B55=0,\"\",IF(AB55=Daten!A$45,\"-\",Daten!F$4))","v":""},{"$f":"IF(B55=0,\"\",IF(AB55=Daten!A$45,\"-\",Daten!F$6))","v":""},{"$f":"IF(B55=0,\"\",IF(AB55=Daten!A$45,\"-\",Daten!F$2))","v":""},{"$f":"IF(B55=0,\"\",IF(AB55=Daten!A$45,\"-\",Daten!F$3))","v":""},"",{"$f":"IF(B55=0,\"\",IF(OR(C55=\"Nein\",Daten!D51=\"Ohne\"),\"-\",Daten!D$9))","v":""},{"$f":"IF(B55=0,\"\",IF(OR(C55=\"Nein\",Daten!D51=\"Ohne\"),\"-\",IF(Daten!D$8=\"Rahmendämmung\",Daten!D$10,\"-\")))","v":""},{"$f":"IF(B55=0,\"\",IF(AND(C55=\"Ja\",Daten!D$15=TRUE),Daten!D$16,\"-\"))","v":""},{"$f":"IF(AN55=\"\",\"\",IF(AND(C55=\"Ja\",Daten!D$15=TRUE),Daten!D$18,\"-\"))","v":""},{"$f":"IF(B55=0,\"\",IF(Daten!H$7=TRUE,\"bauseits\",IF(Daten!H$8=TRUE,\"FSP 40\",\"WSP 40\")))","v":""},{"$f":"IF(B55=0,\"\",Daten!H$10)","v":""},{"$f":"IFERROR(IF(B55=0,\"\",IF(Daten!H$2=TRUE,1,0)*IF(J55+P55+P55+Q55+Q55>Daten!B$62,0,1)*IF(K55+P55+Z55+AF55+10>Daten!B$62,0,1)),0)","v":""}]
[null,null,{"$f":"IF(A56=\"\",\"\",IF(Daten!D$1<>\"Keine\",\"Ja\",\"Nein\"))","v":""},{"$f":"IF(A56=\"\",\"\",IF(Daten!B$4=TRUE,\"QB\",\"BS\")&IF(AR56=1,\"G\",\"\")&IF(C56=\"Nein\",\"-V\",IF(Daten!D$11=TRUE,\"-S\",\"-H\"))&IF(Daten!B$1=TRUE,\"-E\",\"\")&IF(Daten!F$9=TRUE,\"-B\",\"\")&IF(Daten!F$8=TRUE,\"A\",\"\"))","v":""},{"$f":"IF(A56=\"\",\"\",IFERROR(VLOOKUP(D56,Daten!D$43:G$94,2,FALSE),\"spez.\"))","v":""},null,null,null,null,{"$f":"IF(F56<>\"\",F56+(2*(Daten!B$13+2)),IF(H56<>\"\",H56-10,\"\"))","v":""},{"$f":"IFERROR(IF(G56<>\"\",G56+Daten!B$14+Daten!B$15+2+IF(AG56=\"-\",0,AG56),IF(I56<>\"\",I56-5,\"\")),\"\")","v":""},{"$f":"IF(B56=0,\"\",IF(L$1=0,0,Daten!B$10))","v":""},{"$f":"IF(B56=0,\"\",IF(M$1=0,0,Daten!B$11))","v":""},{"$f":"IF(B56=0,\"\",IF(N$1=0,0,Daten!B$12))","v":""},"",{"$f":"IF(B56=0,\"\",Daten!B$6)","v":""},{"$f":"IF(B56=0,\"\",Daten!B$16)","v":""},{"$f":"IF(B56=0,\"\",IF(Daten!B$1=TRUE,Daten!B$17,\"-\"))","v":""},{"$f":"IF(B56=0,\"\",IF(C56=\"Nein\",\"-\",Daten!D$7))","v":""},{"$f":"IF(B56=\"\",\"\",IF(C56=\"Nein\",\"-\",IF(T$1=0,\"\",Daten!D$12)))","v":""},{"$f":"IF(B56=\"\",\"\",IF(C56=\"Nein\",\"-\",IF(T$1=0,\"\",Daten!D$13)))","v":""},{"$f":"IF(B56=\"\",\"\",IF(C56=\"Nein\",\"-\",IF(T$1=0,\"\",IF(AK56=\"\",\"\",AK56+X56-Daten!D$20))))","v":""},{"$f":"IF(B56=0,\"\",IF(L$1=1,M56+N56,Daten!D$2))","v":""},{"$f":"IF(B56=0,\"\",IF(C56=\"Nein\",\"-\",Daten!D$6))","v":""},{"$f":"IF(B56=0,\"\",IF(C56=\"Nein\",\"-\",Daten!D$3))","v":""},{"$f":"IF(B56=0,\"\",Daten!D$4)","v":""},{"$f":"IF(B56=0,\"\",IF(C56=\"Nein\",\"-\",Daten!D$5))","v":""},{"$f":"IF(B56=0,\"\",IF(Daten!F$1=\"Keine\",Daten!A$45,IF(Daten!F$7=TRUE,Daten!A$48,Daten!A$44)))","v":""},{"$f":"IF(B56=0,\"\",IF(AB56=\"Standard\",IF(Daten!F$9=TRUE,1,0),0))","v":""},"",{"$f":"IF(B56=0,\"\",IF(OR(AB56=Daten!A$46,AB56=Daten!A$47,AB56=Daten!A$48),AI56+W56,\"-\"))","v":""},{"$f":"IF(B56=0,\"\",IF(AB56=Daten!A$45,\"-\",Daten!F$5))","v":""},{"$f":"IF(B56=0,\"\",IF(AB56=Daten!A$45,\"-\",Daten!F$4))","v":""},{"$f":"IF(B56=0,\"\",IF(AB56=Daten!A$45,\"-\",Daten!F$6))","v":""},{"$f":"IF(B56=0,\"\",IF(AB56=Daten!A$45,\"-\",Daten!F$2))","v":""},{"$f":"IF(B56=0,\"\",IF(AB56=Daten!A$45,\"-\",Daten!F$3))","v":""},"",{"$f":"IF(B56=0,\"\",IF(OR(C56=\"Nein\",Daten!D53=\"Ohne\"),\"-\",Daten!D$9))","v":""},{"$f":"IF(B56=0,\"\",IF(OR(C56=\"Nein\",Daten!D53=\"Ohne\"),\"-\",IF(Daten!D$8=\"Rahmendämmung\",Daten!D$10,\"-\")))","v":""},{"$f":"IF(B56=0,\"\",IF(AND(C56=\"Ja\",Daten!D$15=TRUE),Daten!D$16,\"-\"))","v":""},{"$f":"IF(AN56=\"\",\"\",IF(AND(C56=\"Ja\",Daten!D$15=TRUE),Daten!D$18,\"-\"))","v":""},{"$f":"IF(B56=0,\"\",IF(Daten!H$7=TRUE,\"bauseits\",IF(Daten!H$8=TRUE,\"FSP 40\",\"WSP 40\")))","v":""},{"$f":"IF(B56=0,\"\",Daten!H$10)","v":""},{"$f":"IFERROR(IF(B56=0,\"\",IF(Daten!H$2=TRUE,1,0)*IF(J56+P56+P56+Q56+Q56>Daten!B$62,0,1)*IF(K56+P56+Z56+AF56+10>Daten!B$62,0,1)),0)","v":""}]
[null,null,{"$f":"IF(A57=\"\",\"\",IF(Daten!D$1<>\"Keine\",\"Ja\",\"Nein\"))","v":""},{"$f":"IF(A57=\"\",\"\",IF(Daten!B$4=TRUE,\"QB\",\"BS\")&IF(AR57=1,\"G\",\"\")&IF(C57=\"Nein\",\"-V\",IF(Daten!D$11=TRUE,\"-S\",\"-H\"))&IF(Daten!B$1=TRUE,\"-E\",\"\")&IF(Daten!F$9=TRUE,\"-B\",\"\")&IF(Daten!F$8=TRUE,\"A\",\"\"))","v":""},{"$f":"IF(A57=\"\",\"\",IFERROR(VLOOKUP(D57,Daten!D$43:G$94,2,FALSE),\"spez.\"))","v":""},null,null,null,null,{"$f":"IF(F57<>\"\",F57+(2*(Daten!B$13+2)),IF(H57<>\"\",H57-10,\"\"))","v":""},{"$f":"IFERROR(IF(G57<>\"\",G57+Daten!B$14+Daten!B$15+2+IF(AG57=\"-\",0,AG57),IF(I57<>\"\",I57-5,\"\")),\"\")","v":""},{"$f":"IF(B57=0,\"\",IF(L$1=0,0,Daten!B$10))","v":""},{"$f":"IF(B57=0,\"\",IF(M$1=0,0,Daten!B$11))","v":""},{"$f":"IF(B57=0,\"\",IF(N$1=0,0,Daten!B$12))","v":""},"",{"$f":"IF(B57=0,\"\",Daten!B$6)","v":""},{"$f":"IF(B57=0,\"\",Daten!B$16)","v":""},{"$f":"IF(B57=0,\"\",IF(Daten!B$1=TRUE,Daten!B$17,\"-\"))","v":""},{"$f":"IF(B57=0,\"\",IF(C57=\"Nein\",\"-\",Daten!D$7))","v":""},{"$f":"IF(B57=\"\",\"\",IF(C57=\"Nein\",\"-\",IF(T$1=0,\"\",Daten!D$12)))","v":""},{"$f":"IF(B57=\"\",\"\",IF(C57=\"Nein\",\"-\",IF(T$1=0,\"\",Daten!D$13)))","v":""},{"$f":"IF(B57=\"\",\"\",IF(C57=\"Nein\",\"-\",IF(T$1=0,\"\",IF(AK57=\"\",\"\",AK57+X57-Daten!D$20))))","v":""},{"$f":"IF(B57=0,\"\",IF(L$1=1,M57+N57,Daten!D$2))","v":""},{"$f":"IF(B57=0,\"\",IF(C57=\"Nein\",\"-\",Daten!D$6))","v":""},{"$f":"IF(B57=0,\"\",IF(C57=\"Nein\",\"-\",Daten!D$3))","v":""},{"$f":"IF(B57=0,\"\",Daten!D$4)","v":""},{"$f":"IF(B57=0,\"\",IF(C57=\"Nein\",\"-\",Daten!D$5))","v":""},{"$f":"IF(B57=0,\"\",IF(Daten!F$1=\"Keine\",Daten!A$45,IF(Daten!F$7=TRUE,Daten!A$48,Daten!A$44)))","v":""},{"$f":"IF(B57=0,\"\",IF(AB57=\"Standard\",IF(Daten!F$9=TRUE,1,0),0))","v":""},"",{"$f":"IF(B57=0,\"\",IF(OR(AB57=Daten!A$46,AB57=Daten!A$47,AB57=Daten!A$48),AI57+W57,\"-\"))","v":""},{"$f":"IF(B57=0,\"\",IF(AB57=Daten!A$45,\"-\",Daten!F$5))","v":""},{"$f":"IF(B57=0,\"\",IF(AB57=Daten!A$45,\"-\",Daten!F$4))","v":""},{"$f":"IF(B57=0,\"\",IF(AB57=Daten!A$45,\"-\",Daten!F$6))","v":""},{"$f":"IF(B57=0,\"\",IF(AB57=Daten!A$45,\"-\",Daten!F$2))","v":""},{"$f":"IF(B57=0,\"\",IF(AB57=Daten!A$45,\"-\",Daten!F$3))","v":""},"",{"$f":"IF(B57=0,\"\",IF(OR(C57=\"Nein\",Daten!D54=\"Ohne\"),\"-\",Daten!D$9))","v":""},{"$f":"IF(B57=0,\"\",IF(OR(C57=\"Nein\",Daten!D54=\"Ohne\"),\"-\",IF(Daten!D$8=\"Rahmendämmung\",Daten!D$10,\"-\")))","v":""},{"$f":"IF(B57=0,\"\",IF(AND(C57=\"Ja\",Daten!D$15=TRUE),Daten!D$16,\"-\"))","v":""},{"$f":"IF(AN57=\"\",\"\",IF(AND(C57=\"Ja\",Daten!D$15=TRUE),Daten!D$18,\"-\"))","v":""},{"$f":"IF(B57=0,\"\",IF(Daten!H$7=TRUE,\"bauseits\",IF(Daten!H$8=TRUE,\"FSP 40\",\"WSP 40\")))","v":""},{"$f":"IF(B57=0,\"\",Daten!H$10)","v":""},{"$f":"IFERROR(IF(B57=0,\"\",IF(Daten!H$2=TRUE,1,0)*IF(J57+P57+P57+Q57+Q57>Daten!B$62,0,1)*IF(K57+P57+Z57+AF57+10>Daten!B$62,0,1)),0)","v":""}]
[null,null,{"$f":"IF(A58=\"\",\"\",IF(Daten!D$1<>\"Keine\",\"Ja\",\"Nein\"))","v":""},{"$f":"IF(A58=\"\",\"\",IF(Daten!B$4=TRUE,\"QB\",\"BS\")&IF(AR58=1,\"G\",\"\")&IF(C58=\"Nein\",\"-V\",IF(Daten!D$11=TRUE,\"-S\",\"-H\"))&IF(Daten!B$1=TRUE,\"-E\",\"\")&IF(Daten!F$9=TRUE,\"-B\",\"\")&IF(Daten!F$8=TRUE,\"A\",\"\"))","v":""},{"$f":"IF(A58=\"\",\"\",IFERROR(VLOOKUP(D58,Daten!D$43:G$94,2,FALSE),\"spez.\"))","v":""},null,null,null,null,{"$f":"IF(F58<>\"\",F58+(2*(Daten!B$13+2)),IF(H58<>\"\",H58-10,\"\"))","v":""},{"$f":"IFERROR(IF(G58<>\"\",G58+Daten!B$14+Daten!B$15+2+IF(AG58=\"-\",0,AG58),IF(I58<>\"\",I58-5,\"\")),\"\")","v":""},{"$f":"IF(B58=0,\"\",IF(L$1=0,0,Daten!B$10))","v":""},{"$f":"IF(B58=0,\"\",IF(M$1=0,0,Daten!B$11))","v":""},{"$f":"IF(B58=0,\"\",IF(N$1=0,0,Daten!B$12))","v":""},"",{"$f":"IF(B58=0,\"\",Daten!B$6)","v":""},{"$f":"IF(B58=0,\"\",Daten!B$16)","v":""},{"$f":"IF(B58=0,\"\",IF(Daten!B$1=TRUE,Daten!B$17,\"-\"))","v":""},{"$f":"IF(B58=0,\"\",IF(C58=\"Nein\",\"-\",Daten!D$7))","v":""},{"$f":"IF(B58=\"\",\"\",IF(C58=\"Nein\",\"-\",IF(T$1=0,\"\",Daten!D$12)))","v":""},{"$f":"IF(B58=\"\",\"\",IF(C58=\"Nein\",\"-\",IF(T$1=0,\"\",Daten!D$13)))","v":""},{"$f":"IF(B58=\"\",\"\",IF(C58=\"Nein\",\"-\",IF(T$1=0,\"\",IF(AK58=\"\",\"\",AK58+X58-Daten!D$20))))","v":""},{"$f":"IF(B58=0,\"\",IF(L$1=1,M58+N58,Daten!D$2))","v":""},{"$f":"IF(B58=0,\"\",IF(C58=\"Nein\",\"-\",Daten!D$6))","v":""},{"$f":"IF(B58=0,\"\",IF(C58=\"Nein\",\"-\",Daten!D$3))","v":""},{"$f":"IF(B58=0,\"\",Daten!D$4)","v":""},{"$f":"IF(B58=0,\"\",IF(C58=\"Nein\",\"-\",Daten!D$5))","v":""},{"$f":"IF(B58=0,\"\",IF(Daten!F$1=\"Keine\",Daten!A$45,IF(Daten!F$7=TRUE,Daten!A$48,Daten!A$44)))","v":""},{"$f":"IF(B58=0,\"\",IF(AB58=\"Standard\",IF(Daten!F$9=TRUE,1,0),0))","v":""},"",{"$f":"IF(B58=0,\"\",IF(OR(AB58=Daten!A$46,AB58=Daten!A$47,AB58=Daten!A$48),AI58+W58,\"-\"))","v":""},{"$f":"IF(B58=0,\"\",IF(AB58=Daten!A$45,\"-\",Daten!F$5))","v":""},{"$f":"IF(B58=0,\"\",IF(AB58=Daten!A$45,\"-\",Daten!F$4))","v":""},{"$f":"IF(B58=0,\"\",IF(AB58=Daten!A$45,\"-\",Daten!F$6))","v":""},{"$f":"IF(B58=0,\"\",IF(AB58=Daten!A$45,\"-\",Daten!F$2))","v":""},{"$f":"IF(B58=0,\"\",IF(AB58=Daten!A$45,\"-\",Daten!F$3))","v":""},"",{"$f":"IF(B58=0,\"\",IF(OR(C58=\"Nein\",Daten!D56=\"Ohne\"),\"-\",Daten!D$9))","v":""},{"$f":"IF(B58=0,\"\",IF(OR(C58=\"Nein\",Daten!D56=\"Ohne\"),\"-\",IF(Daten!D$8=\"Rahmendämmung\",Daten!D$10,\"-\")))","v":""},{"$f":"IF(B58=0,\"\",IF(AND(C58=\"Ja\",Daten!D$15=TRUE),Daten!D$16,\"-\"))","v":""},{"$f":"IF(AN58=\"\",\"\",IF(AND(C58=\"Ja\",Daten!D$15=TRUE),Daten!D$18,\"-\"))","v":""},{"$f":"IF(B58=0,\"\",IF(Daten!H$7=TRUE,\"bauseits\",IF(Daten!H$8=TRUE,\"FSP 40\",\"WSP 40\")))","v":""},{"$f":"IF(B58=0,\"\",Daten!H$10)","v":""},{"$f":"IFERROR(IF(B58=0,\"\",IF(Daten!H$2=TRUE,1,0)*IF(J58+P58+P58+Q58+Q58>Daten!B$62,0,1)*IF(K58+P58+Z58+AF58+10>Daten!B$62,0,1)),0)","v":""}]
[null,null,{"$f":"IF(A59=\"\",\"\",IF(Daten!D$1<>\"Keine\",\"Ja\",\"Nein\"))","v":""},{"$f":"IF(A59=\"\",\"\",IF(Daten!B$4=TRUE,\"QB\",\"BS\")&IF(AR59=1,\"G\",\"\")&IF(C59=\"Nein\",\"-V\",IF(Daten!D$11=TRUE,\"-S\",\"-H\"))&IF(Daten!B$1=TRUE,\"-E\",\"\")&IF(Daten!F$9=TRUE,\"-B\",\"\")&IF(Daten!F$8=TRUE,\"A\",\"\"))","v":""},{"$f":"IF(A59=\"\",\"\",IFERROR(VLOOKUP(D59,Daten!D$43:G$94,2,FALSE),\"spez.\"))","v":""},null,null,null,null,{"$f":"IF(F59<>\"\",F59+(2*(Daten!B$13+2)),IF(H59<>\"\",H59-10,\"\"))","v":""},{"$f":"IFERROR(IF(G59<>\"\",G59+Daten!B$14+Daten!B$15+2+IF(AG59=\"-\",0,AG59),IF(I59<>\"\",I59-5,\"\")),\"\")","v":""},{"$f":"IF(B59=0,\"\",IF(L$1=0,0,Daten!B$10))","v":""},{"$f":"IF(B59=0,\"\",IF(M$1=0,0,Daten!B$11))","v":""},{"$f":"IF(B59=0,\"\",IF(N$1=0,0,Daten!B$12))","v":""},"",{"$f":"IF(B59=0,\"\",Daten!B$6)","v":""},{"$f":"IF(B59=0,\"\",Daten!B$16)","v":""},{"$f":"IF(B59=0,\"\",IF(Daten!B$1=TRUE,Daten!B$17,\"-\"))","v":""},{"$f":"IF(B59=0,\"\",IF(C59=\"Nein\",\"-\",Daten!D$7))","v":""},{"$f":"IF(B59=\"\",\"\",IF(C59=\"Nein\",\"-\",IF(T$1=0,\"\",Daten!D$12)))","v":""},{"$f":"IF(B59=\"\",\"\",IF(C59=\"Nein\",\"-\",IF(T$1=0,\"\",Daten!D$13)))","v":""},{"$f":"IF(B59=\"\",\"\",IF(C59=\"Nein\",\"-\",IF(T$1=0,\"\",IF(AK59=\"\",\"\",AK59+X59-Daten!D$20))))","v":""},{"$f":"IF(B59=0,\"\",IF(L$1=1,M59+N59,Daten!D$2))","v":""},{"$f":"IF(B59=0,\"\",IF(C59=\"Nein\",\"-\",Daten!D$6))","v":""},{"$f":"IF(B59=0,\"\",IF(C59=\"Nein\",\"-\",Daten!D$3))","v":""},{"$f":"IF(B59=0,\"\",Daten!D$4)","v":""},{"$f":"IF(B59=0,\"\",IF(C59=\"Nein\",\"-\",Daten!D$5))","v":""},{"$f":"IF(B59=0,\"\",IF(Daten!F$1=\"Keine\",Daten!A$45,IF(Daten!F$7=TRUE,Daten!A$48,Daten!A$44)))","v":""},{"$f":"IF(B59=0,\"\",IF(AB59=\"Standard\",IF(Daten!F$9=TRUE,1,0),0))","v":""},"",{"$f":"IF(B59=0,\"\",IF(OR(AB59=Daten!A$46,AB59=Daten!A$47,AB59=Daten!A$48),AI59+W59,\"-\"))","v":""},{"$f":"IF(B59=0,\"\",IF(AB59=Daten!A$45,\"-\",Daten!F$5))","v":""},{"$f":"IF(B59=0,\"\",IF(AB59=Daten!A$45,\"-\",Daten!F$4))","v":""},{"$f":"IF(B59=0,\"\",IF(AB59=Daten!A$45,\"-\",Daten!F$6))","v":""},{"$f":"IF(B59=0,\"\",IF(AB59=Daten!A$45,\"-\",Daten!F$2))","v":""},{"$f":"IF(B59=0,\"\",IF(AB59=Daten!A$45,\"-\",Daten!F$3))","v":""},"",{"$f":"IF(B59=0,\"\",IF(OR(C59=\"Nein\",Daten!D58=\"Ohne\"),\"-\",Daten!D$9))","v":""},{"$f":"IF(B59=0,\"\",IF(OR(C59=\"Nein\",Daten!D58=\"Ohne\"),\"-\",IF(Daten!D$8=\"Rahmendämmung\",Daten!D$10,\"-\")))","v":""},{"$f":"IF(B59=0,\"\",IF(AND(C59=\"Ja\",Daten!D$15=TRUE),Daten!D$16,\"-\"))","v":""},{"$f":"IF(AN59=\"\",\"\",IF(AND(C59=\"Ja\",Daten!D$15=TRUE),Daten!D$18,\"-\"))","v":""},{"$f":"IF(B59=0,\"\",IF(Daten!H$7=TRUE,\"bauseits\",IF(Daten!H$8=TRUE,\"FSP 40\",\"WSP 40\")))","v":""},{"$f":"IF(B59=0,\"\",Daten!H$10)","v":""},{"$f":"IFERROR(IF(B59=0,\"\",IF(Daten!H$2=TRUE,1,0)*IF(J59+P59+P59+Q59+Q59>Daten!B$62,0,1)*IF(K59+P59+Z59+AF59+10>Daten!B$62,0,1)),0)","v":""}]
[null,null,{"$f":"IF(A60=\"\",\"\",IF(Daten!D$1<>\"Keine\",\"Ja\",\"Nein\"))","v":""},{"$f":"IF(A60=\"\",\"\",IF(Daten!B$4=TRUE,\"QB\",\"BS\")&IF(AR60=1,\"G\",\"\")&IF(C60=\"Nein\",\"-V\",IF(Daten!D$11=TRUE,\"-S\",\"-H\"))&IF(Daten!B$1=TRUE,\"-E\",\"\")&IF(Daten!F$9=TRUE,\"-B\",\"\")&IF(Daten!F$8=TRUE,\"A\",\"\"))","v":""},{"$f":"IF(A60=\"\",\"\",IFERROR(VLOOKUP(D60,Daten!D$43:G$94,2,FALSE),\"spez.\"))","v":""},null,null,null,null,{"$f":"IF(F60<>\"\",F60+(2*(Daten!B$13+2)),IF(H60<>\"\",H60-10,\"\"))","v":""},{"$f":"IFERROR(IF(G60<>\"\",G60+Daten!B$14+Daten!B$15+2+IF(AG60=\"-\",0,AG60),IF(I60<>\"\",I60-5,\"\")),\"\")","v":""},{"$f":"IF(B60=0,\"\",IF(L$1=0,0,Daten!B$10))","v":""},{"$f":"IF(B60=0,\"\",IF(M$1=0,0,Daten!B$11))","v":""},{"$f":"IF(B60=0,\"\",IF(N$1=0,0,Daten!B$12))","v":""},"",{"$f":"IF(B60=0,\"\",Daten!B$6)","v":""},{"$f":"IF(B60=0,\"\",Daten!B$16)","v":""},{"$f":"IF(B60=0,\"\",IF(Daten!B$1=TRUE,Daten!B$17,\"-\"))","v":""},{"$f":"IF(B60=0,\"\",IF(C60=\"Nein\",\"-\",Daten!D$7))","v":""},{"$f":"IF(B60=\"\",\"\",IF(C60=\"Nein\",\"-\",IF(T$1=0,\"\",Daten!D$12)))","v":""},{"$f":"IF(B60=\"\",\"\",IF(C60=\"Nein\",\"-\",IF(T$1=0,\"\",Daten!D$13)))","v":""},{"$f":"IF(B60=\"\",\"\",IF(C60=\"Nein\",\"-\",IF(T$1=0,\"\",IF(AK60=\"\",\"\",AK60+X60-Daten!D$20))))","v":""},{"$f":"IF(B60=0,\"\",IF(L$1=1,M60+N60,Daten!D$2))","v":""},{"$f":"IF(B60=0,\"\",IF(C60=\"Nein\",\"-\",Daten!D$6))","v":""},{"$f":"IF(B60=0,\"\",IF(C60=\"Nein\",\"-\",Daten!D$3))","v":""},{"$f":"IF(B60=0,\"\",Daten!D$4)","v":""},{"$f":"IF(B60=0,\"\",IF(C60=\"Nein\",\"-\",Daten!D$5))","v":""},{"$f":"IF(B60=0,\"\",IF(Daten!F$1=\"Keine\",Daten!A$45,IF(Daten!F$7=TRUE,Daten!A$48,Daten!A$44)))","v":""},{"$f":"IF(B60=0,\"\",IF(AB60=\"Standard\",IF(Daten!F$9=TRUE,1,0),0))","v":""},"",{"$f":"IF(B60=0,\"\",IF(OR(AB60=Daten!A$46,AB60=Daten!A$47,AB60=Daten!A$48),AI60+W60,\"-\"))","v":""},{"$f":"IF(B60=0,\"\",IF(AB60=Daten!A$45,\"-\",Daten!F$5))","v":""},{"$f":"IF(B60=0,\"\",IF(AB60=Daten!A$45,\"-\",Daten!F$4))","v":""},{"$f":"IF(B60=0,\"\",IF(AB60=Daten!A$45,\"-\",Daten!F$6))","v":""},{"$f":"IF(B60=0,\"\",IF(AB60=Daten!A$45,\"-\",Daten!F$2))","v":""},{"$f":"IF(B60=0,\"\",IF(AB60=Daten!A$45,\"-\",Daten!F$3))","v":""},"",{"$f":"IF(B60=0,\"\",IF(OR(C60=\"Nein\",Daten!D59=\"Ohne\"),\"-\",Daten!D$9))","v":""},{"$f":"IF(B60=0,\"\",IF(OR(C60=\"Nein\",Daten!D59=\"Ohne\"),\"-\",IF(Daten!D$8=\"Rahmendämmung\",Daten!D$10,\"-\")))","v":""},{"$f":"IF(B60=0,\"\",IF(AND(C60=\"Ja\",Daten!D$15=TRUE),Daten!D$16,\"-\"))","v":""},{"$f":"IF(AN60=\"\",\"\",IF(AND(C60=\"Ja\",Daten!D$15=TRUE),Daten!D$18,\"-\"))","v":""},{"$f":"IF(B60=0,\"\",IF(Daten!H$7=TRUE,\"bauseits\",IF(Daten!H$8=TRUE,\"FSP 40\",\"WSP 40\")))","v":""},{"$f":"IF(B60=0,\"\",Daten!H$10)","v":""},{"$f":"IFERROR(IF(B60=0,\"\",IF(Daten!H$2=TRUE,1,0)*IF(J60+P60+P60+Q60+Q60>Daten!B$62,0,1)*IF(K60+P60+Z60+AF60+10>Daten!B$62,0,1)),0)","v":""}]
[null,null,{"$f":"IF(A61=\"\",\"\",IF(Daten!D$1<>\"Keine\",\"Ja\",\"Nein\"))","v":""},{"$f":"IF(A61=\"\",\"\",IF(Daten!B$4=TRUE,\"QB\",\"BS\")&IF(AR61=1,\"G\",\"\")&IF(C61=\"Nein\",\"-V\",IF(Daten!D$11=TRUE,\"-S\",\"-H\"))&IF(Daten!B$1=TRUE,\"-E\",\"\")&IF(Daten!F$9=TRUE,\"-B\",\"\")&IF(Daten!F$8=TRUE,\"A\",\"\"))","v":""},{"$f":"IF(A61=\"\",\"\",IFERROR(VLOOKUP(D61,Daten!D$43:G$94,2,FALSE),\"spez.\"))","v":""},null,null,null,null,{"$f":"IF(F61<>\"\",F61+(2*(Daten!B$13+2)),IF(H61<>\"\",H61-10,\"\"))","v":""},{"$f":"IFERROR(IF(G61<>\"\",G61+Daten!B$14+Daten!B$15+2+IF(AG61=\"-\",0,AG61),IF(I61<>\"\",I61-5,\"\")),\"\")","v":""},{"$f":"IF(B61=0,\"\",IF(L$1=0,0,Daten!B$10))","v":""},{"$f":"IF(B61=0,\"\",IF(M$1=0,0,Daten!B$11))","v":""},{"$f":"IF(B61=0,\"\",IF(N$1=0,0,Daten!B$12))","v":""},"",{"$f":"IF(B61=0,\"\",Daten!B$6)","v":""},{"$f":"IF(B61=0,\"\",Daten!B$16)","v":""},{"$f":"IF(B61=0,\"\",IF(Daten!B$1=TRUE,Daten!B$17,\"-\"))","v":""},{"$f":"IF(B61=0,\"\",IF(C61=\"Nein\",\"-\",Daten!D$7))","v":""},{"$f":"IF(B61=\"\",\"\",IF(C61=\"Nein\",\"-\",IF(T$1=0,\"\",Daten!D$12)))","v":""},{"$f":"IF(B61=\"\",\"\",IF(C61=\"Nein\",\"-\",IF(T$1=0,\"\",Daten!D$13)))","v":""},{"$f":"IF(B61=\"\",\"\",IF(C61=\"Nein\",\"-\",IF(T$1=0,\"\",IF(AK61=\"\",\"\",AK61+X61-Daten!D$20))))","v":""},{"$f":"IF(B61=0,\"\",IF(L$1=1,M61+N61,Daten!D$2))","v":""},{"$f":"IF(B61=0,\"\",IF(C61=\"Nein\",\"-\",Daten!D$6))","v":""},{"$f":"IF(B61=0,\"\",IF(C61=\"Nein\",\"-\",Daten!D$3))","v":""},{"$f":"IF(B61=0,\"\",Daten!D$4)","v":""},{"$f":"IF(B61=0,\"\",IF(C61=\"Nein\",\"-\",Daten!D$5))","v":""},{"$f":"IF(B61=0,\"\",IF(Daten!F$1=\"Keine\",Daten!A$45,IF(Daten!F$7=TRUE,Daten!A$48,Daten!A$44)))","v":""},{"$f":"IF(B61=0,\"\",IF(AB61=\"Standard\",IF(Daten!F$9=TRUE,1,0),0))","v":""},"",{"$f":"IF(B61=0,\"\",IF(OR(AB61=Daten!A$46,AB61=Daten!A$47,AB61=Daten!A$48),AI61+W61,\"-\"))","v":""},{"$f":"IF(B61=0,\"\",IF(AB61=Daten!A$45,\"-\",Daten!F$5))","v":""},{"$f":"IF(B61=0,\"\",IF(AB61=Daten!A$45,\"-\",Daten!F$4))","v":""},{"$f":"IF(B61=0,\"\",IF(AB61=Daten!A$45,\"-\",Daten!F$6))","v":""},{"$f":"IF(B61=0,\"\",IF(AB61=Daten!A$45,\"-\",Daten!F$2))","v":""},{"$f":"IF(B61=0,\"\",IF(AB61=Daten!A$45,\"-\",Daten!F$3))","v":""},"",{"$f":"IF(B61=0,\"\",IF(OR(C61=\"Nein\",Daten!D66=\"Ohne\"),\"-\",Daten!D$9))","v":""},{"$f":"IF(B61=0,\"\",IF(OR(C61=\"Nein\",Daten!D66=\"Ohne\"),\"-\",IF(Daten!D$8=\"Rahmendämmung\",Daten!D$10,\"-\")))","v":""},{"$f":"IF(B61=0,\"\",IF(AND(C61=\"Ja\",Daten!D$15=TRUE),Daten!D$16,\"-\"))","v":""},{"$f":"IF(AN61=\"\",\"\",IF(AND(C61=\"Ja\",Daten!D$15=TRUE),Daten!D$18,\"-\"))","v":""},{"$f":"IF(B61=0,\"\",IF(Daten!H$7=TRUE,\"bauseits\",IF(Daten!H$8=TRUE,\"FSP 40\",\"WSP 40\")))","v":""},{"$f":"IF(B61=0,\"\",Daten!H$10)","v":""},{"$f":"IFERROR(IF(B61=0,\"\",IF(Daten!H$2=TRUE,1,0)*IF(J61+P61+P61+Q61+Q61>Daten!B$62,0,1)*IF(K61+P61+Z61+AF61+10>Daten!B$62,0,1)),0)","v":""}]
[null,null,{"$f":"IF(A62=\"\",\"\",IF(Daten!D$1<>\"Keine\",\"Ja\",\"Nein\"))","v":""},{"$f":"IF(A62=\"\",\"\",IF(Daten!B$4=TRUE,\"QB\",\"BS\")&IF(AR62=1,\"G\",\"\")&IF(C62=\"Nein\",\"-V\",IF(Daten!D$11=TRUE,\"-S\",\"-H\"))&IF(Daten!B$1=TRUE,\"-E\",\"\")&IF(Daten!F$9=TRUE,\"-B\",\"\")&IF(Daten!F$8=TRUE,\"A\",\"\"))","v":""},{"$f":"IF(A62=\"\",\"\",IFERROR(VLOOKUP(D62,Daten!D$43:G$94,2,FALSE),\"spez.\"))","v":""},null,null,null,null,{"$f":"IF(F62<>\"\",F62+(2*(Daten!B$13+2)),IF(H62<>\"\",H62-10,\"\"))","v":""},{"$f":"IFERROR(IF(G62<>\"\",G62+Daten!B$14+Daten!B$15+2+IF(AG62=\"-\",0,AG62),IF(I62<>\"\",I62-5,\"\")),\"\")","v":""},{"$f":"IF(B62=0,\"\",IF(L$1=0,0,Daten!B$10))","v":""},{"$f":"IF(B62=0,\"\",IF(M$1=0,0,Daten!B$11))","v":""},{"$f":"IF(B62=0,\"\",IF(N$1=0,0,Daten!B$12))","v":""},"",{"$f":"IF(B62=0,\"\",Daten!B$6)","v":""},{"$f":"IF(B62=0,\"\",Daten!B$16)","v":""},{"$f":"IF(B62=0,\"\",IF(Daten!B$1=TRUE,Daten!B$17,\"-\"))","v":""},{"$f":"IF(B62=0,\"\",IF(C62=\"Nein\",\"-\",Daten!D$7))","v":""},{"$f":"IF(B62=\"\",\"\",IF(C62=\"Nein\",\"-\",IF(T$1=0,\"\",Daten!D$12)))","v":""},{"$f":"IF(B62=\"\",\"\",IF(C62=\"Nein\",\"-\",IF(T$1=0,\"\",Daten!D$13)))","v":""},{"$f":"IF(B62=\"\",\"\",IF(C62=\"Nein\",\"-\",IF(T$1=0,\"\",IF(AK62=\"\",\"\",AK62+X62-Daten!D$20))))","v":""},{"$f":"IF(B62=0,\"\",IF(L$1=1,M62+N62,Daten!D$2))","v":""},{"$f":"IF(B62=0,\"\",IF(C62=\"Nein\",\"-\",Daten!D$6))","v":""},{"$f":"IF(B62=0,\"\",IF(C62=\"Nein\",\"-\",Daten!D$3))","v":""},{"$f":"IF(B62=0,\"\",Daten!D$4)","v":""},{"$f":"IF(B62=0,\"\",IF(C62=\"Nein\",\"-\",Daten!D$5))","v":""},{"$f":"IF(B62=0,\"\",IF(Daten!F$1=\"Keine\",Daten!A$45,IF(Daten!F$7=TRUE,Daten!A$48,Daten!A$44)))","v":""},{"$f":"IF(B62=0,\"\",IF(AB62=\"Standard\",IF(Daten!F$9=TRUE,1,0),0))","v":""},"",{"$f":"IF(B62=0,\"\",IF(OR(AB62=Daten!A$46,AB62=Daten!A$47,AB62=Daten!A$48),AI62+W62,\"-\"))","v":""},{"$f":"IF(B62=0,\"\",IF(AB62=Daten!A$45,\"-\",Daten!F$5))","v":""},{"$f":"IF(B62=0,\"\",IF(AB62=Daten!A$45,\"-\",Daten!F$4))","v":""},{"$f":"IF(B62=0,\"\",IF(AB62=Daten!A$45,\"-\",Daten!F$6))","v":""},{"$f":"IF(B62=0,\"\",IF(AB62=Daten!A$45,\"-\",Daten!F$2))","v":""},{"$f":"IF(B62=0,\"\",IF(AB62=Daten!A$45,\"-\",Daten!F$3))","v":""},"",{"$f":"IF(B62=0,\"\",IF(OR(C62=\"Nein\",Daten!D67=\"Ohne\"),\"-\",Daten!D$9))","v":""},{"$f":"IF(B62=0,\"\",IF(OR(C62=\"Nein\",Daten!D67=\"Ohne\"),\"-\",IF(Daten!D$8=\"Rahmendämmung\",Daten!D$10,\"-\")))","v":""},{"$f":"IF(B62=0,\"\",IF(AND(C62=\"Ja\",Daten!D$15=TRUE),Daten!D$16,\"-\"))","v":""},{"$f":"IF(AN62=\"\",\"\",IF(AND(C62=\"Ja\",Daten!D$15=TRUE),Daten!D$18,\"-\"))","v":""},{"$f":"IF(B62=0,\"\",IF(Daten!H$7=TRUE,\"bauseits\",IF(Daten!H$8=TRUE,\"FSP 40\",\"WSP 40\")))","v":""},{"$f":"IF(B62=0,\"\",Daten!H$10)","v":""},{"$f":"IFERROR(IF(B62=0,\"\",IF(Daten!H$2=TRUE,1,0)*IF(J62+P62+P62+Q62+Q62>Daten!B$62,0,1)*IF(K62+P62+Z62+AF62+10>Daten!B$62,0,1)),0)","v":""}]
[null,null,{"$f":"IF(A63=\"\",\"\",IF(Daten!D$1<>\"Keine\",\"Ja\",\"Nein\"))","v":""},{"$f":"IF(A63=\"\",\"\",IF(Daten!B$4=TRUE,\"QB\",\"BS\")&IF(AR63=1,\"G\",\"\")&IF(C63=\"Nein\",\"-V\",IF(Daten!D$11=TRUE,\"-S\",\"-H\"))&IF(Daten!B$1=TRUE,\"-E\",\"\")&IF(Daten!F$9=TRUE,\"-B\",\"\")&IF(Daten!F$8=TRUE,\"A\",\"\"))","v":""},{"$f":"IF(A63=\"\",\"\",IFERROR(VLOOKUP(D63,Daten!D$43:G$94,2,FALSE),\"spez.\"))","v":""},null,null,null,null,{"$f":"IF(F63<>\"\",F63+(2*(Daten!B$13+2)),IF(H63<>\"\",H63-10,\"\"))","v":""},{"$f":"IFERROR(IF(G63<>\"\",G63+Daten!B$14+Daten!B$15+2+IF(AG63=\"-\",0,AG63),IF(I63<>\"\",I63-5,\"\")),\"\")","v":""},{"$f":"IF(B63=0,\"\",IF(L$1=0,0,Daten!B$10))","v":""},{"$f":"IF(B63=0,\"\",IF(M$1=0,0,Daten!B$11))","v":""},{"$f":"IF(B63=0,\"\",IF(N$1=0,0,Daten!B$12))","v":""},"",{"$f":"IF(B63=0,\"\",Daten!B$6)","v":""},{"$f":"IF(B63=0,\"\",Daten!B$16)","v":""},{"$f":"IF(B63=0,\"\",IF(Daten!B$1=TRUE,Daten!B$17,\"-\"))","v":""},{"$f":"IF(B63=0,\"\",IF(C63=\"Nein\",\"-\",Daten!D$7))","v":""},{"$f":"IF(B63=\"\",\"\",IF(C63=\"Nein\",\"-\",IF(T$1=0,\"\",Daten!D$12)))","v":""},{"$f":"IF(B63=\"\",\"\",IF(C63=\"Nein\",\"-\",IF(T$1=0,\"\",Daten!D$13)))","v":""},{"$f":"IF(B63=\"\",\"\",IF(C63=\"Nein\",\"-\",IF(T$1=0,\"\",IF(AK63=\"\",\"\",AK63+X63-Daten!D$20))))","v":""},{"$f":"IF(B63=0,\"\",IF(L$1=1,M63+N63,Daten!D$2))","v":""},{"$f":"IF(B63=0,\"\",IF(C63=\"Nein\",\"-\",Daten!D$6))","v":""},{"$f":"IF(B63=0,\"\",IF(C63=\"Nein\",\"-\",Daten!D$3))","v":""},{"$f":"IF(B63=0,\"\",Daten!D$4)","v":""},{"$f":"IF(B63=0,\"\",IF(C63=\"Nein\",\"-\",Daten!D$5))","v":""},{"$f":"IF(B63=0,\"\",IF(Daten!F$1=\"Keine\",Daten!A$45,IF(Daten!F$7=TRUE,Daten!A$48,Daten!A$44)))","v":""},{"$f":"IF(B63=0,\"\",IF(AB63=\"Standard\",IF(Daten!F$9=TRUE,1,0),0))","v":""},"",{"$f":"IF(B63=0,\"\",IF(OR(AB63=Daten!A$46,AB63=Daten!A$47,AB63=Daten!A$48),AI63+W63,\"-\"))","v":""},{"$f":"IF(B63=0,\"\",IF(AB63=Daten!A$45,\"-\",Daten!F$5))","v":""},{"$f":"IF(B63=0,\"\",IF(AB63=Daten!A$45,\"-\",Daten!F$4))","v":""},{"$f":"IF(B63=0,\"\",IF(AB63=Daten!A$45,\"-\",Daten!F$6))","v":""},{"$f":"IF(B63=0,\"\",IF(AB63=Daten!A$45,\"-\",Daten!F$2))","v":""},{"$f":"IF(B63=0,\"\",IF(AB63=Daten!A$45,\"-\",Daten!F$3))","v":""},"",{"$f":"IF(B63=0,\"\",IF(OR(C63=\"Nein\",Daten!D68=\"Ohne\"),\"-\",Daten!D$9))","v":""},{"$f":"IF(B63=0,\"\",IF(OR(C63=\"Nein\",Daten!D68=\"Ohne\"),\"-\",IF(Daten!D$8=\"Rahmendämmung\",Daten!D$10,\"-\")))","v":""},{"$f":"IF(B63=0,\"\",IF(AND(C63=\"Ja\",Daten!D$15=TRUE),Daten!D$16,\"-\"))","v":""},{"$f":"IF(AN63=\"\",\"\",IF(AND(C63=\"Ja\",Daten!D$15=TRUE),Daten!D$18,\"-\"))","v":""},{"$f":"IF(B63=0,\"\",IF(Daten!H$7=TRUE,\"bauseits\",IF(Daten!H$8=TRUE,\"FSP 40\",\"WSP 40\")))","v":""},{"$f":"IF(B63=0,\"\",Daten!H$10)","v":""},{"$f":"IFERROR(IF(B63=0,\"\",IF(Daten!H$2=TRUE,1,0)*IF(J63+P63+P63+Q63+Q63>Daten!B$62,0,1)*IF(K63+P63+Z63+AF63+10>Daten!B$62,0,1)),0)","v":""}]
[null,null,{"$f":"IF(A64=\"\",\"\",IF(Daten!D$1<>\"Keine\",\"Ja\",\"Nein\"))","v":""},{"$f":"IF(A64=\"\",\"\",IF(Daten!B$4=TRUE,\"QB\",\"BS\")&IF(AR64=1,\"G\",\"\")&IF(C64=\"Nein\",\"-V\",IF(Daten!D$11=TRUE,\"-S\",\"-H\"))&IF(Daten!B$1=TRUE,\"-E\",\"\")&IF(Daten!F$9=TRUE,\"-B\",\"\")&IF(Daten!F$8=TRUE,\"A\",\"\"))","v":""},{"$f":"IF(A64=\"\",\"\",IFERROR(VLOOKUP(D64,Daten!D$43:G$94,2,FALSE),\"spez.\"))","v":""},null,null,null,null,{"$f":"IF(F64<>\"\",F64+(2*(Daten!B$13+2)),IF(H64<>\"\",H64-10,\"\"))","v":""},{"$f":"IFERROR(IF(G64<>\"\",G64+Daten!B$14+Daten!B$15+2+IF(AG64=\"-\",0,AG64),IF(I64<>\"\",I64-5,\"\")),\"\")","v":""},{"$f":"IF(B64=0,\"\",IF(L$1=0,0,Daten!B$10))","v":""},{"$f":"IF(B64=0,\"\",IF(M$1=0,0,Daten!B$11))","v":""},{"$f":"IF(B64=0,\"\",IF(N$1=0,0,Daten!B$12))","v":""},"",{"$f":"IF(B64=0,\"\",Daten!B$6)","v":""},{"$f":"IF(B64=0,\"\",Daten!B$16)","v":""},{"$f":"IF(B64=0,\"\",IF(Daten!B$1=TRUE,Daten!B$17,\"-\"))","v":""},{"$f":"IF(B64=0,\"\",IF(C64=\"Nein\",\"-\",Daten!D$7))","v":""},{"$f":"IF(B64=\"\",\"\",IF(C64=\"Nein\",\"-\",IF(T$1=0,\"\",Daten!D$12)))","v":""},{"$f":"IF(B64=\"\",\"\",IF(C64=\"Nein\",\"-\",IF(T$1=0,\"\",Daten!D$13)))","v":""},{"$f":"IF(B64=\"\",\"\",IF(C64=\"Nein\",\"-\",IF(T$1=0,\"\",IF(AK64=\"\",\"\",AK64+X64-Daten!D$20))))","v":""},{"$f":"IF(B64=0,\"\",IF(L$1=1,M64+N64,Daten!D$2))","v":""},{"$f":"IF(B64=0,\"\",IF(C64=\"Nein\",\"-\",Daten!D$6))","v":""},{"$f":"IF(B64=0,\"\",IF(C64=\"Nein\",\"-\",Daten!D$3))","v":""},{"$f":"IF(B64=0,\"\",Daten!D$4)","v":""},{"$f":"IF(B64=0,\"\",IF(C64=\"Nein\",\"-\",Daten!D$5))","v":""},{"$f":"IF(B64=0,\"\",IF(Daten!F$1=\"Keine\",Daten!A$45,IF(Daten!F$7=TRUE,Daten!A$48,Daten!A$44)))","v":""},{"$f":"IF(B64=0,\"\",IF(AB64=\"Standard\",IF(Daten!F$9=TRUE,1,0),0))","v":""},"",{"$f":"IF(B64=0,\"\",IF(OR(AB64=Daten!A$46,AB64=Daten!A$47,AB64=Daten!A$48),AI64+W64,\"-\"))","v":""},{"$f":"IF(B64=0,\"\",IF(AB64=Daten!A$45,\"-\",Daten!F$5))","v":""},{"$f":"IF(B64=0,\"\",IF(AB64=Daten!A$45,\"-\",Daten!F$4))","v":""},{"$f":"IF(B64=0,\"\",IF(AB64=Daten!A$45,\"-\",Daten!F$6))","v":""},{"$f":"IF(B64=0,\"\",IF(AB64=Daten!A$45,\"-\",Daten!F$2))","v":""},{"$f":"IF(B64=0,\"\",IF(AB64=Daten!A$45,\"-\",Daten!F$3))","v":""},"",{"$f":"IF(B64=0,\"\",IF(OR(C64=\"Nein\",Daten!D69=\"Ohne\"),\"-\",Daten!D$9))","v":""},{"$f":"IF(B64=0,\"\",IF(OR(C64=\"Nein\",Daten!D69=\"Ohne\"),\"-\",IF(Daten!D$8=\"Rahmendämmung\",Daten!D$10,\"-\")))","v":""},{"$f":"IF(B64=0,\"\",IF(AND(C64=\"Ja\",Daten!D$15=TRUE),Daten!D$16,\"-\"))","v":""},{"$f":"IF(AN64=\"\",\"\",IF(AND(C64=\"Ja\",Daten!D$15=TRUE),Daten!D$18,\"-\"))","v":""},{"$f":"IF(B64=0,\"\",IF(Daten!H$7=TRUE,\"bauseits\",IF(Daten!H$8=TRUE,\"FSP 40\",\"WSP 40\")))","v":""},{"$f":"IF(B64=0,\"\",Daten!H$10)","v":""},{"$f":"IFERROR(IF(B64=0,\"\",IF(Daten!H$2=TRUE,1,0)*IF(J64+P64+P64+Q64+Q64>Daten!B$62,0,1)*IF(K64+P64+Z64+AF64+10>Daten!B$62,0,1)),0)","v":""}]
[null,null,{"$f":"IF(A65=\"\",\"\",IF(Daten!D$1<>\"Keine\",\"Ja\",\"Nein\"))","v":""},{"$f":"IF(A65=\"\",\"\",IF(Daten!B$4=TRUE,\"QB\",\"BS\")&IF(AR65=1,\"G\",\"\")&IF(C65=\"Nein\",\"-V\",IF(Daten!D$11=TRUE,\"-S\",\"-H\"))&IF(Daten!B$1=TRUE,\"-E\",\"\")&IF(Daten!F$9=TRUE,\"-B\",\"\")&IF(Daten!F$8=TRUE,\"A\",\"\"))","v":""},{"$f":"IF(A65=\"\",\"\",IFERROR(VLOOKUP(D65,Daten!D$43:G$94,2,FALSE),\"spez.\"))","v":""},null,null,null,null,{"$f":"IF(F65<>\"\",F65+(2*(Daten!B$13+2)),IF(H65<>\"\",H65-10,\"\"))","v":""},{"$f":"IFERROR(IF(G65<>\"\",G65+Daten!B$14+Daten!B$15+2+IF(AG65=\"-\",0,AG65),IF(I65<>\"\",I65-5,\"\")),\"\")","v":""},{"$f":"IF(B65=0,\"\",IF(L$1=0,0,Daten!B$10))","v":""},{"$f":"IF(B65=0,\"\",IF(M$1=0,0,Daten!B$11))","v":""},{"$f":"IF(B65=0,\"\",IF(N$1=0,0,Daten!B$12))","v":""},"",{"$f":"IF(B65=0,\"\",Daten!B$6)","v":""},{"$f":"IF(B65=0,\"\",Daten!B$16)","v":""},{"$f":"IF(B65=0,\"\",IF(Daten!B$1=TRUE,Daten!B$17,\"-\"))","v":""},{"$f":"IF(B65=0,\"\",IF(C65=\"Nein\",\"-\",Daten!D$7))","v":""},{"$f":"IF(B65=\"\",\"\",IF(C65=\"Nein\",\"-\",IF(T$1=0,\"\",Daten!D$12)))","v":""},{"$f":"IF(B65=\"\",\"\",IF(C65=\"Nein\",\"-\",IF(T$1=0,\"\",Daten!D$13)))","v":""},{"$f":"IF(B65=\"\",\"\",IF(C65=\"Nein\",\"-\",IF(T$1=0,\"\",IF(AK65=\"\",\"\",AK65+X65-Daten!D$20))))","v":""},{"$f":"IF(B65=0,\"\",IF(L$1=1,M65+N65,Daten!D$2))","v":""},{"$f":"IF(B65=0,\"\",IF(C65=\"Nein\",\"-\",Daten!D$6))","v":""},{"$f":"IF(B65=0,\"\",IF(C65=\"Nein\",\"-\",Daten!D$3))","v":""},{"$f":"IF(B65=0,\"\",Daten!D$4)","v":""},{"$f":"IF(B65=0,\"\",IF(C65=\"Nein\",\"-\",Daten!D$5))","v":""},{"$f":"IF(B65=0,\"\",IF(Daten!F$1=\"Keine\",Daten!A$45,IF(Daten!F$7=TRUE,Daten!A$48,Daten!A$44)))","v":""},{"$f":"IF(B65=0,\"\",IF(AB65=\"Standard\",IF(Daten!F$9=TRUE,1,0),0))","v":""},"",{"$f":"IF(B65=0,\"\",IF(OR(AB65=Daten!A$46,AB65=Daten!A$47,AB65=Daten!A$48),AI65+W65,\"-\"))","v":""},{"$f":"IF(B65=0,\"\",IF(AB65=Daten!A$45,\"-\",Daten!F$5))","v":""},{"$f":"IF(B65=0,\"\",IF(AB65=Daten!A$45,\"-\",Daten!F$4))","v":""},{"$f":"IF(B65=0,\"\",IF(AB65=Daten!A$45,\"-\",Daten!F$6))","v":""},{"$f":"IF(B65=0,\"\",IF(AB65=Daten!A$45,\"-\",Daten!F$2))","v":""},{"$f":"IF(B65=0,\"\",IF(AB65=Daten!A$45,\"-\",Daten!F$3))","v":""},"",{"$f":"IF(B65=0,\"\",IF(OR(C65=\"Nein\",Daten!D70=\"Ohne\"),\"-\",Daten!D$9))","v":""},{"$f":"IF(B65=0,\"\",IF(OR(C65=\"Nein\",Daten!D70=\"Ohne\"),\"-\",IF(Daten!D$8=\"Rahmendämmung\",Daten!D$10,\"-\")))","v":""},{"$f":"IF(B65=0,\"\",IF(AND(C65=\"Ja\",Daten!D$15=TRUE),Daten!D$16,\"-\"))","v":""},{"$f":"IF(AN65=\"\",\"\",IF(AND(C65=\"Ja\",Daten!D$15=TRUE),Daten!D$18,\"-\"))","v":""},{"$f":"IF(B65=0,\"\",IF(Daten!H$7=TRUE,\"bauseits\",IF(Daten!H$8=TRUE,\"FSP 40\",\"WSP 40\")))","v":""},{"$f":"IF(B65=0,\"\",Daten!H$10)","v":""},{"$f":"IFERROR(IF(B65=0,\"\",IF(Daten!H$2=TRUE,1,0)*IF(J65+P65+P65+Q65+Q65>Daten!B$62,0,1)*IF(K65+P65+Z65+AF65+10>Daten!B$62,0,1)),0)","v":""}]
[null,null,{"$f":"IF(A66=\"\",\"\",IF(Daten!D$1<>\"Keine\",\"Ja\",\"Nein\"))","v":""},{"$f":"IF(A66=\"\",\"\",IF(Daten!B$4=TRUE,\"QB\",\"BS\")&IF(AR66=1,\"G\",\"\")&IF(C66=\"Nein\",\"-V\",IF(Daten!D$11=TRUE,\"-S\",\"-H\"))&IF(Daten!B$1=TRUE,\"-E\",\"\")&IF(Daten!F$9=TRUE,\"-B\",\"\")&IF(Daten!F$8=TRUE,\"A\",\"\"))","v":""},{"$f":"IF(A66=\"\",\"\",IFERROR(VLOOKUP(D66,Daten!D$43:G$94,2,FALSE),\"spez.\"))","v":""},null,null,null,null,{"$f":"IF(F66<>\"\",F66+(2*(Daten!B$13+2)),IF(H66<>\"\",H66-10,\"\"))","v":""},{"$f":"IFERROR(IF(G66<>\"\",G66+Daten!B$14+Daten!B$15+2+IF(AG66=\"-\",0,AG66),IF(I66<>\"\",I66-5,\"\")),\"\")","v":""},{"$f":"IF(B66=0,\"\",IF(L$1=0,0,Daten!B$10))","v":""},{"$f":"IF(B66=0,\"\",IF(M$1=0,0,Daten!B$11))","v":""},{"$f":"IF(B66=0,\"\",IF(N$1=0,0,Daten!B$12))","v":""},"",{"$f":"IF(B66=0,\"\",Daten!B$6)","v":""},{"$f":"IF(B66=0,\"\",Daten!B$16)","v":""},{"$f":"IF(B66=0,\"\",IF(Daten!B$1=TRUE,Daten!B$17,\"-\"))","v":""},{"$f":"IF(B66=0,\"\",IF(C66=\"Nein\",\"-\",Daten!D$7))","v":""},{"$f":"IF(B66=\"\",\"\",IF(C66=\"Nein\",\"-\",IF(T$1=0,\"\",Daten!D$12)))","v":""},{"$f":"IF(B66=\"\",\"\",IF(C66=\"Nein\",\"-\",IF(T$1=0,\"\",Daten!D$13)))","v":""},{"$f":"IF(B66=\"\",\"\",IF(C66=\"Nein\",\"-\",IF(T$1=0,\"\",IF(AK66=\"\",\"\",AK66+X66-Daten!D$20))))","v":""},{"$f":"IF(B66=0,\"\",IF(L$1=1,M66+N66,Daten!D$2))","v":""},{"$f":"IF(B66=0,\"\",IF(C66=\"Nein\",\"-\",Daten!D$6))","v":""},{"$f":"IF(B66=0,\"\",IF(C66=\"Nein\",\"-\",Daten!D$3))","v":""},{"$f":"IF(B66=0,\"\",Daten!D$4)","v":""},{"$f":"IF(B66=0,\"\",IF(C66=\"Nein\",\"-\",Daten!D$5))","v":""},{"$f":"IF(B66=0,\"\",IF(Daten!F$1=\"Keine\",Daten!A$45,IF(Daten!F$7=TRUE,Daten!A$48,Daten!A$44)))","v":""},{"$f":"IF(B66=0,\"\",IF(AB66=\"Standard\",IF(Daten!F$9=TRUE,1,0),0))","v":""},"",{"$f":"IF(B66=0,\"\",IF(OR(AB66=Daten!A$46,AB66=Daten!A$47,AB66=Daten!A$48),AI66+W66,\"-\"))","v":""},{"$f":"IF(B66=0,\"\",IF(AB66=Daten!A$45,\"-\",Daten!F$5))","v":""},{"$f":"IF(B66=0,\"\",IF(AB66=Daten!A$45,\"-\",Daten!F$4))","v":""},{"$f":"IF(B66=0,\"\",IF(AB66=Daten!A$45,\"-\",Daten!F$6))","v":""},{"$f":"IF(B66=0,\"\",IF(AB66=Daten!A$45,\"-\",Daten!F$2))","v":""},{"$f":"IF(B66=0,\"\",IF(AB66=Daten!A$45,\"-\",Daten!F$3))","v":""},"",{"$f":"IF(B66=0,\"\",IF(OR(C66=\"Nein\",Daten!D71=\"Ohne\"),\"-\",Daten!D$9))","v":""},{"$f":"IF(B66=0,\"\",IF(OR(C66=\"Nein\",Daten!D71=\"Ohne\"),\"-\",IF(Daten!D$8=\"Rahmendämmung\",Daten!D$10,\"-\")))","v":""},{"$f":"IF(B66=0,\"\",IF(AND(C66=\"Ja\",Daten!D$15=TRUE),Daten!D$16,\"-\"))","v":""},{"$f":"IF(AN66=\"\",\"\",IF(AND(C66=\"Ja\",Daten!D$15=TRUE),Daten!D$18,\"-\"))","v":""},{"$f":"IF(B66=0,\"\",IF(Daten!H$7=TRUE,\"bauseits\",IF(Daten!H$8=TRUE,\"FSP 40\",\"WSP 40\")))","v":""},{"$f":"IF(B66=0,\"\",Daten!H$10)","v":""},{"$f":"IFERROR(IF(B66=0,\"\",IF(Daten!H$2=TRUE,1,0)*IF(J66+P66+P66+Q66+Q66>Daten!B$62,0,1)*IF(K66+P66+Z66+AF66+10>Daten!B$62,0,1)),0)","v":""}]
[null,null,{"$f":"IF(A67=\"\",\"\",IF(Daten!D$1<>\"Keine\",\"Ja\",\"Nein\"))","v":""},{"$f":"IF(A67=\"\",\"\",IF(Daten!B$4=TRUE,\"QB\",\"BS\")&IF(AR67=1,\"G\",\"\")&IF(C67=\"Nein\",\"-V\",IF(Daten!D$11=TRUE,\"-S\",\"-H\"))&IF(Daten!B$1=TRUE,\"-E\",\"\")&IF(Daten!F$9=TRUE,\"-B\",\"\")&IF(Daten!F$8=TRUE,\"A\",\"\"))","v":""},{"$f":"IF(A67=\"\",\"\",IFERROR(VLOOKUP(D67,Daten!D$43:G$94,2,FALSE),\"spez.\"))","v":""},null,null,null,null,{"$f":"IF(F67<>\"\",F67+(2*(Daten!B$13+2)),IF(H67<>\"\",H67-10,\"\"))","v":""},{"$f":"IFERROR(IF(G67<>\"\",G67+Daten!B$14+Daten!B$15+2+IF(AG67=\"-\",0,AG67),IF(I67<>\"\",I67-5,\"\")),\"\")","v":""},{"$f":"IF(B67=0,\"\",IF(L$1=0,0,Daten!B$10))","v":""},{"$f":"IF(B67=0,\"\",IF(M$1=0,0,Daten!B$11))","v":""},{"$f":"IF(B67=0,\"\",IF(N$1=0,0,Daten!B$12))","v":""},"",{"$f":"IF(B67=0,\"\",Daten!B$6)","v":""},{"$f":"IF(B67=0,\"\",Daten!B$16)","v":""},{"$f":"IF(B67=0,\"\",IF(Daten!B$1=TRUE,Daten!B$17,\"-\"))","v":""},{"$f":"IF(B67=0,\"\",IF(C67=\"Nein\",\"-\",Daten!D$7))","v":""},{"$f":"IF(B67=\"\",\"\",IF(C67=\"Nein\",\"-\",IF(T$1=0,\"\",Daten!D$12)))","v":""},{"$f":"IF(B67=\"\",\"\",IF(C67=\"Nein\",\"-\",IF(T$1=0,\"\",Daten!D$13)))","v":""},{"$f":"IF(B67=\"\",\"\",IF(C67=\"Nein\",\"-\",IF(T$1=0,\"\",IF(AK67=\"\",\"\",AK67+X67-Daten!D$20))))","v":""},{"$f":"IF(B67=0,\"\",IF(L$1=1,M67+N67,Daten!D$2))","v":""},{"$f":"IF(B67=0,\"\",IF(C67=\"Nein\",\"-\",Daten!D$6))","v":""},{"$f":"IF(B67=0,\"\",IF(C67=\"Nein\",\"-\",Daten!D$3))","v":""},{"$f":"IF(B67=0,\"\",Daten!D$4)","v":""},{"$f":"IF(B67=0,\"\",IF(C67=\"Nein\",\"-\",Daten!D$5))","v":""},{"$f":"IF(B67=0,\"\",IF(Daten!F$1=\"Keine\",Daten!A$45,IF(Daten!F$7=TRUE,Daten!A$48,Daten!A$44)))","v":""},{"$f":"IF(B67=0,\"\",IF(AB67=\"Standard\",IF(Daten!F$9=TRUE,1,0),0))","v":""},"",{"$f":"IF(B67=0,\"\",IF(OR(AB67=Daten!A$46,AB67=Daten!A$47,AB67=Daten!A$48),AI67+W67,\"-\"))","v":""},{"$f":"IF(B67=0,\"\",IF(AB67=Daten!A$45,\"-\",Daten!F$5))","v":""},{"$f":"IF(B67=0,\"\",IF(AB67=Daten!A$45,\"-\",Daten!F$4))","v":""},{"$f":"IF(B67=0,\"\",IF(AB67=Daten!A$45,\"-\",Daten!F$6))","v":""},{"$f":"IF(B67=0,\"\",IF(AB67=Daten!A$45,\"-\",Daten!F$2))","v":""},{"$f":"IF(B67=0,\"\",IF(AB67=Daten!A$45,\"-\",Daten!F$3))","v":""},"",{"$f":"IF(B67=0,\"\",IF(OR(C67=\"Nein\",Daten!D60=\"Ohne\"),\"-\",Daten!D$9))","v":""},{"$f":"IF(B67=0,\"\",IF(OR(C67=\"Nein\",Daten!D60=\"Ohne\"),\"-\",IF(Daten!D$8=\"Rahmendämmung\",Daten!D$10,\"-\")))","v":""},{"$f":"IF(B67=0,\"\",IF(AND(C67=\"Ja\",Daten!D$15=TRUE),Daten!D$16,\"-\"))","v":""},{"$f":"IF(AN67=\"\",\"\",IF(AND(C67=\"Ja\",Daten!D$15=TRUE),Daten!D$18,\"-\"))","v":""},{"$f":"IF(B67=0,\"\",IF(Daten!H$7=TRUE,\"bauseits\",IF(Daten!H$8=TRUE,\"FSP 40\",\"WSP 40\")))","v":""},{"$f":"IF(B67=0,\"\",Daten!H$10)","v":""},{"$f":"IFERROR(IF(B67=0,\"\",IF(Daten!H$2=TRUE,1,0)*IF(J67+P67+P67+Q67+Q67>Daten!B$62,0,1)*IF(K67+P67+Z67+AF67+10>Daten!B$62,0,1)),0)","v":""}]
[null,null,{"$f":"IF(A68=\"\",\"\",IF(Daten!D$1<>\"Keine\",\"Ja\",\"Nein\"))","v":""},{"$f":"IF(A68=\"\",\"\",IF(Daten!B$4=TRUE,\"QB\",\"BS\")&IF(AR68=1,\"G\",\"\")&IF(C68=\"Nein\",\"-V\",IF(Daten!D$11=TRUE,\"-S\",\"-H\"))&IF(Daten!B$1=TRUE,\"-E\",\"\")&IF(Daten!F$9=TRUE,\"-B\",\"\")&IF(Daten!F$8=TRUE,\"A\",\"\"))","v":""},{"$f":"IF(A68=\"\",\"\",IFERROR(VLOOKUP(D68,Daten!D$43:G$94,2,FALSE),\"spez.\"))","v":""},null,null,null,null,{"$f":"IF(F68<>\"\",F68+(2*(Daten!B$13+2)),IF(H68<>\"\",H68-10,\"\"))","v":""},{"$f":"IFERROR(IF(G68<>\"\",G68+Daten!B$14+Daten!B$15+2+IF(AG68=\"-\",0,AG68),IF(I68<>\"\",I68-5,\"\")),\"\")","v":""},{"$f":"IF(B68=0,\"\",IF(L$1=0,0,Daten!B$10))","v":""},{"$f":"IF(B68=0,\"\",IF(M$1=0,0,Daten!B$11))","v":""},{"$f":"IF(B68=0,\"\",IF(N$1=0,0,Daten!B$12))","v":""},"",{"$f":"IF(B68=0,\"\",Daten!B$6)","v":""},{"$f":"IF(B68=0,\"\",Daten!B$16)","v":""},{"$f":"IF(B68=0,\"\",IF(Daten!B$1=TRUE,Daten!B$17,\"-\"))","v":""},{"$f":"IF(B68=0,\"\",IF(C68=\"Nein\",\"-\",Daten!D$7))","v":""},{"$f":"IF(B68=\"\",\"\",IF(C68=\"Nein\",\"-\",IF(T$1=0,\"\",Daten!D$12)))","v":""},{"$f":"IF(B68=\"\",\"\",IF(C68=\"Nein\",\"-\",IF(T$1=0,\"\",Daten!D$13)))","v":""},{"$f":"IF(B68=\"\",\"\",IF(C68=\"Nein\",\"-\",IF(T$1=0,\"\",IF(AK68=\"\",\"\",AK68+X68-Daten!D$20))))","v":""},{"$f":"IF(B68=0,\"\",IF(L$1=1,M68+N68,Daten!D$2))","v":""},{"$f":"IF(B68=0,\"\",IF(C68=\"Nein\",\"-\",Daten!D$6))","v":""},{"$f":"IF(B68=0,\"\",IF(C68=\"Nein\",\"-\",Daten!D$3))","v":""},{"$f":"IF(B68=0,\"\",Daten!D$4)","v":""},{"$f":"IF(B68=0,\"\",IF(C68=\"Nein\",\"-\",Daten!D$5))","v":""},{"$f":"IF(B68=0,\"\",IF(Daten!F$1=\"Keine\",Daten!A$45,IF(Daten!F$7=TRUE,Daten!A$48,Daten!A$44)))","v":""},{"$f":"IF(B68=0,\"\",IF(AB68=\"Standard\",IF(Daten!F$9=TRUE,1,0),0))","v":""},"",{"$f":"IF(B68=0,\"\",IF(OR(AB68=Daten!A$46,AB68=Daten!A$47,AB68=Daten!A$48),AI68+W68,\"-\"))","v":""},{"$f":"IF(B68=0,\"\",IF(AB68=Daten!A$45,\"-\",Daten!F$5))","v":""},{"$f":"IF(B68=0,\"\",IF(AB68=Daten!A$45,\"-\",Daten!F$4))","v":""},{"$f":"IF(B68=0,\"\",IF(AB68=Daten!A$45,\"-\",Daten!F$6))","v":""},{"$f":"IF(B68=0,\"\",IF(AB68=Daten!A$45,\"-\",Daten!F$2))","v":""},{"$f":"IF(B68=0,\"\",IF(AB68=Daten!A$45,\"-\",Daten!F$3))","v":""},"",{"$f":"IF(B68=0,\"\",IF(OR(C68=\"Nein\",Daten!D61=\"Ohne\"),\"-\",Daten!D$9))","v":""},{"$f":"IF(B68=0,\"\",IF(OR(C68=\"Nein\",Daten!D61=\"Ohne\"),\"-\",IF(Daten!D$8=\"Rahmendämmung\",Daten!D$10,\"-\")))","v":""},{"$f":"IF(B68=0,\"\",IF(AND(C68=\"Ja\",Daten!D$15=TRUE),Daten!D$16,\"-\"))","v":""},{"$f":"IF(AN68=\"\",\"\",IF(AND(C68=\"Ja\",Daten!D$15=TRUE),Daten!D$18,\"-\"))","v":""},{"$f":"IF(B68=0,\"\",IF(Daten!H$7=TRUE,\"bauseits\",IF(Daten!H$8=TRUE,\"FSP 40\",\"WSP 40\")))","v":""},{"$f":"IF(B68=0,\"\",Daten!H$10)","v":""},{"$f":"IFERROR(IF(B68=0,\"\",IF(Daten!H$2=TRUE,1,0)*IF(J68+P68+P68+Q68+Q68>Daten!B$62,0,1)*IF(K68+P68+Z68+AF68+10>Daten!B$62,0,1)),0)","v":""}]
[null,null,{"$f":"IF(A69=\"\",\"\",IF(Daten!D$1<>\"Keine\",\"Ja\",\"Nein\"))","v":""},{"$f":"IF(A69=\"\",\"\",IF(Daten!B$4=TRUE,\"QB\",\"BS\")&IF(AR69=1,\"G\",\"\")&IF(C69=\"Nein\",\"-V\",IF(Daten!D$11=TRUE,\"-S\",\"-H\"))&IF(Daten!B$1=TRUE,\"-E\",\"\")&IF(Daten!F$9=TRUE,\"-B\",\"\")&IF(Daten!F$8=TRUE,\"A\",\"\"))","v":""},{"$f":"IF(A69=\"\",\"\",IFERROR(VLOOKUP(D69,Daten!D$43:G$94,2,FALSE),\"spez.\"))","v":""},null,null,null,null,{"$f":"IF(F69<>\"\",F69+(2*(Daten!B$13+2)),IF(H69<>\"\",H69-10,\"\"))","v":""},{"$f":"IFERROR(IF(G69<>\"\",G69+Daten!B$14+Daten!B$15+2+IF(AG69=\"-\",0,AG69),IF(I69<>\"\",I69-5,\"\")),\"\")","v":""},{"$f":"IF(B69=0,\"\",IF(L$1=0,0,Daten!B$10))","v":""},{"$f":"IF(B69=0,\"\",IF(M$1=0,0,Daten!B$11))","v":""},{"$f":"IF(B69=0,\"\",IF(N$1=0,0,Daten!B$12))","v":""},"",{"$f":"IF(B69=0,\"\",Daten!B$6)","v":""},{"$f":"IF(B69=0,\"\",Daten!B$16)","v":""},{"$f":"IF(B69=0,\"\",IF(Daten!B$1=TRUE,Daten!B$17,\"-\"))","v":""},{"$f":"IF(B69=0,\"\",IF(C69=\"Nein\",\"-\",Daten!D$7))","v":""},{"$f":"IF(B69=\"\",\"\",IF(C69=\"Nein\",\"-\",IF(T$1=0,\"\",Daten!D$12)))","v":""},{"$f":"IF(B69=\"\",\"\",IF(C69=\"Nein\",\"-\",IF(T$1=0,\"\",Daten!D$13)))","v":""},{"$f":"IF(B69=\"\",\"\",IF(C69=\"Nein\",\"-\",IF(T$1=0,\"\",IF(AK69=\"\",\"\",AK69+X69-Daten!D$20))))","v":""},{"$f":"IF(B69=0,\"\",IF(L$1=1,M69+N69,Daten!D$2))","v":""},{"$f":"IF(B69=0,\"\",IF(C69=\"Nein\",\"-\",Daten!D$6))","v":""},{"$f":"IF(B69=0,\"\",IF(C69=\"Nein\",\"-\",Daten!D$3))","v":""},{"$f":"IF(B69=0,\"\",Daten!D$4)","v":""},{"$f":"IF(B69=0,\"\",IF(C69=\"Nein\",\"-\",Daten!D$5))","v":""},{"$f":"IF(B69=0,\"\",IF(Daten!F$1=\"Keine\",Daten!A$45,IF(Daten!F$7=TRUE,Daten!A$48,Daten!A$44)))","v":""},{"$f":"IF(B69=0,\"\",IF(AB69=\"Standard\",IF(Daten!F$9=TRUE,1,0),0))","v":""},"",{"$f":"IF(B69=0,\"\",IF(OR(AB69=Daten!A$46,AB69=Daten!A$47,AB69=Daten!A$48),AI69+W69,\"-\"))","v":""},{"$f":"IF(B69=0,\"\",IF(AB69=Daten!A$45,\"-\",Daten!F$5))","v":""},{"$f":"IF(B69=0,\"\",IF(AB69=Daten!A$45,\"-\",Daten!F$4))","v":""},{"$f":"IF(B69=0,\"\",IF(AB69=Daten!A$45,\"-\",Daten!F$6))","v":""},{"$f":"IF(B69=0,\"\",IF(AB69=Daten!A$45,\"-\",Daten!F$2))","v":""},{"$f":"IF(B69=0,\"\",IF(AB69=Daten!A$45,\"-\",Daten!F$3))","v":""},"",{"$f":"IF(B69=0,\"\",IF(OR(C69=\"Nein\",Daten!D62=\"Ohne\"),\"-\",Daten!D$9))","v":""},{"$f":"IF(B69=0,\"\",IF(OR(C69=\"Nein\",Daten!D62=\"Ohne\"),\"-\",IF(Daten!D$8=\"Rahmendämmung\",Daten!D$10,\"-\")))","v":""},{"$f":"IF(B69=0,\"\",IF(AND(C69=\"Ja\",Daten!D$15=TRUE),Daten!D$16,\"-\"))","v":""},{"$f":"IF(AN69=\"\",\"\",IF(AND(C69=\"Ja\",Daten!D$15=TRUE),Daten!D$18,\"-\"))","v":""},{"$f":"IF(B69=0,\"\",IF(Daten!H$7=TRUE,\"bauseits\",IF(Daten!H$8=TRUE,\"FSP 40\",\"WSP 40\")))","v":""},{"$f":"IF(B69=0,\"\",Daten!H$10)","v":""},{"$f":"IFERROR(IF(B69=0,\"\",IF(Daten!H$2=TRUE,1,0)*IF(J69+P69+P69+Q69+Q69>Daten!B$62,0,1)*IF(K69+P69+Z69+AF69+10>Daten!B$62,0,1)),0)","v":""}]
[null,null,{"$f":"IF(A70=\"\",\"\",IF(Daten!D$1<>\"Keine\",\"Ja\",\"Nein\"))","v":""},{"$f":"IF(A70=\"\",\"\",IF(Daten!B$4=TRUE,\"QB\",\"BS\")&IF(AR70=1,\"G\",\"\")&IF(C70=\"Nein\",\"-V\",IF(Daten!D$11=TRUE,\"-S\",\"-H\"))&IF(Daten!B$1=TRUE,\"-E\",\"\")&IF(Daten!F$9=TRUE,\"-B\",\"\")&IF(Daten!F$8=TRUE,\"A\",\"\"))","v":""},{"$f":"IF(A70=\"\",\"\",IFERROR(VLOOKUP(D70,Daten!D$43:G$94,2,FALSE),\"spez.\"))","v":""},null,null,null,null,{"$f":"IF(F70<>\"\",F70+(2*(Daten!B$13+2)),IF(H70<>\"\",H70-10,\"\"))","v":""},{"$f":"IFERROR(IF(G70<>\"\",G70+Daten!B$14+Daten!B$15+2+IF(AG70=\"-\",0,AG70),IF(I70<>\"\",I70-5,\"\")),\"\")","v":""},{"$f":"IF(B70=0,\"\",IF(L$1=0,0,Daten!B$10))","v":""},{"$f":"IF(B70=0,\"\",IF(M$1=0,0,Daten!B$11))","v":""},{"$f":"IF(B70=0,\"\",IF(N$1=0,0,Daten!B$12))","v":""},"",{"$f":"IF(B70=0,\"\",Daten!B$6)","v":""},{"$f":"IF(B70=0,\"\",Daten!B$16)","v":""},{"$f":"IF(B70=0,\"\",IF(Daten!B$1=TRUE,Daten!B$17,\"-\"))","v":""},{"$f":"IF(B70=0,\"\",IF(C70=\"Nein\",\"-\",Daten!D$7))","v":""},{"$f":"IF(B70=\"\",\"\",IF(C70=\"Nein\",\"-\",IF(T$1=0,\"\",Daten!D$12)))","v":""},{"$f":"IF(B70=\"\",\"\",IF(C70=\"Nein\",\"-\",IF(T$1=0,\"\",Daten!D$13)))","v":""},{"$f":"IF(B70=\"\",\"\",IF(C70=\"Nein\",\"-\",IF(T$1=0,\"\",IF(AK70=\"\",\"\",AK70+X70-Daten!D$20))))","v":""},{"$f":"IF(B70=0,\"\",IF(L$1=1,M70+N70,Daten!D$2))","v":""},{"$f":"IF(B70=0,\"\",IF(C70=\"Nein\",\"-\",Daten!D$6))","v":""},{"$f":"IF(B70=0,\"\",IF(C70=\"Nein\",\"-\",Daten!D$3))","v":""},{"$f":"IF(B70=0,\"\",Daten!D$4)","v":""},{"$f":"IF(B70=0,\"\",IF(C70=\"Nein\",\"-\",Daten!D$5))","v":""},{"$f":"IF(B70=0,\"\",IF(Daten!F$1=\"Keine\",Daten!A$45,IF(Daten!F$7=TRUE,Daten!A$48,Daten!A$44)))","v":""},{"$f":"IF(B70=0,\"\",IF(AB70=\"Standard\",IF(Daten!F$9=TRUE,1,0),0))","v":""},"",{"$f":"IF(B70=0,\"\",IF(OR(AB70=Daten!A$46,AB70=Daten!A$47,AB70=Daten!A$48),AI70+W70,\"-\"))","v":""},{"$f":"IF(B70=0,\"\",IF(AB70=Daten!A$45,\"-\",Daten!F$5))","v":""},{"$f":"IF(B70=0,\"\",IF(AB70=Daten!A$45,\"-\",Daten!F$4))","v":""},{"$f":"IF(B70=0,\"\",IF(AB70=Daten!A$45,\"-\",Daten!F$6))","v":""},{"$f":"IF(B70=0,\"\",IF(AB70=Daten!A$45,\"-\",Daten!F$2))","v":""},{"$f":"IF(B70=0,\"\",IF(AB70=Daten!A$45,\"-\",Daten!F$3))","v":""},"",{"$f":"IF(B70=0,\"\",IF(OR(C70=\"Nein\",Daten!D63=\"Ohne\"),\"-\",Daten!D$9))","v":""},{"$f":"IF(B70=0,\"\",IF(OR(C70=\"Nein\",Daten!D63=\"Ohne\"),\"-\",IF(Daten!D$8=\"Rahmendämmung\",Daten!D$10,\"-\")))","v":""},{"$f":"IF(B70=0,\"\",IF(AND(C70=\"Ja\",Daten!D$15=TRUE),Daten!D$16,\"-\"))","v":""},{"$f":"IF(AN70=\"\",\"\",IF(AND(C70=\"Ja\",Daten!D$15=TRUE),Daten!D$18,\"-\"))","v":""},{"$f":"IF(B70=0,\"\",IF(Daten!H$7=TRUE,\"bauseits\",IF(Daten!H$8=TRUE,\"FSP 40\",\"WSP 40\")))","v":""},{"$f":"IF(B70=0,\"\",Daten!H$10)","v":""},{"$f":"IFERROR(IF(B70=0,\"\",IF(Daten!H$2=TRUE,1,0)*IF(J70+P70+P70+Q70+Q70>Daten!B$62,0,1)*IF(K70+P70+Z70+AF70+10>Daten!B$62,0,1)),0)","v":""}]
[null,null,{"$f":"IF(A71=\"\",\"\",IF(Daten!D$1<>\"Keine\",\"Ja\",\"Nein\"))","v":""},{"$f":"IF(A71=\"\",\"\",IF(Daten!B$4=TRUE,\"QB\",\"BS\")&IF(AR71=1,\"G\",\"\")&IF(C71=\"Nein\",\"-V\",IF(Daten!D$11=TRUE,\"-S\",\"-H\"))&IF(Daten!B$1=TRUE,\"-E\",\"\")&IF(Daten!F$9=TRUE,\"-B\",\"\")&IF(Daten!F$8=TRUE,\"A\",\"\"))","v":""},{"$f":"IF(A71=\"\",\"\",IFERROR(VLOOKUP(D71,Daten!D$43:G$94,2,FALSE),\"spez.\"))","v":""},null,null,null,null,{"$f":"IF(F71<>\"\",F71+(2*(Daten!B$13+2)),IF(H71<>\"\",H71-10,\"\"))","v":""},{"$f":"IFERROR(IF(G71<>\"\",G71+Daten!B$14+Daten!B$15+2+IF(AG71=\"-\",0,AG71),IF(I71<>\"\",I71-5,\"\")),\"\")","v":""},{"$f":"IF(B71=0,\"\",IF(L$1=0,0,Daten!B$10))","v":""},{"$f":"IF(B71=0,\"\",IF(M$1=0,0,Daten!B$11))","v":""},{"$f":"IF(B71=0,\"\",IF(N$1=0,0,Daten!B$12))","v":""},{"$f":"IFERROR(IF(OR(A71=\"\",B71=0),\"\",IF(M$1=1,L71+M71+N71,\"\")),\"\")","v":""},{"$f":"IF(B71=0,\"\",Daten!B$6)","v":""},{"$f":"IF(B71=0,\"\",Daten!B$16)","v":""},{"$f":"IF(B71=0,\"\",IF(Daten!B$1=TRUE,Daten!B$17,\"-\"))","v":""},{"$f":"IF(B71=0,\"\",IF(C71=\"Nein\",\"-\",Daten!D$7))","v":""},{"$f":"IF(B71=\"\",\"\",IF(C71=\"Nein\",\"-\",IF(T$1=0,\"\",Daten!D$12)))","v":""},{"$f":"IF(B71=\"\",\"\",IF(C71=\"Nein\",\"-\",IF(T$1=0,\"\",Daten!D$13)))","v":""},{"$f":"IF(B71=\"\",\"\",IF(C71=\"Nein\",\"-\",IF(T$1=0,\"\",IF(AK71=\"\",\"\",AK71+X71-Daten!D$20))))","v":""},{"$f":"IF(B71=0,\"\",IF(L$1=1,M71+N71,Daten!D$2))","v":""},{"$f":"IF(B71=0,\"\",IF(C71=\"Nein\",\"-\",Daten!D$6))","v":""},{"$f":"IF(B71=0,\"\",IF(C71=\"Nein\",\"-\",Daten!D$3))","v":""},{"$f":"IF(B71=0,\"\",Daten!D$4)","v":""},{"$f":"IF(B71=0,\"\",IF(C71=\"Nein\",\"-\",Daten!D$5))","v":""},{"$f":"IF(B71=0,\"\",IF(Daten!F$1=\"Keine\",Daten!A$45,IF(Daten!F$7=TRUE,Daten!A$48,Daten!A$44)))","v":""},{"$f":"IF(B71=0,\"\",IF(AB71=\"Standard\",IF(Daten!F$9=TRUE,1,0),0))","v":""},{"$f":"IFERROR(O71+AI71+AJ71,\"\")","v":""},{"$f":"IF(B71=0,\"\",IF(OR(AB71=Daten!A$46,AB71=Daten!A$47,AB71=Daten!A$48),AI71+W71,\"-\"))","v":""},{"$f":"IF(B71=0,\"\",IF(AB71=Daten!A$45,\"-\",Daten!F$5))","v":""},{"$f":"IF(B71=0,\"\",IF(AB71=Daten!A$45,\"-\",Daten!F$4))","v":""},{"$f":"IF(B71=0,\"\",IF(AB71=Daten!A$45,\"-\",Daten!F$6))","v":""},{"$f":"IF(B71=0,\"\",IF(AB71=Daten!A$45,\"-\",Daten!F$2))","v":""},{"$f":"IF(B71=0,\"\",IF(AB71=Daten!A$45,\"-\",Daten!F$3))","v":""},{"$f":"IF(B71=0,\"\",IFERROR(IF(C71=\"Nein\",\"-\",O71-X71-Y71-W71),\"\"))","v":""},{"$f":"IF(B71=0,\"\",IF(OR(C71=\"Nein\",Daten!D64=\"Ohne\"),\"-\",Daten!D$9))","v":""},{"$f":"IF(B71=0,\"\",IF(OR(C71=\"Nein\",Daten!D64=\"Ohne\"),\"-\",IF(Daten!D$8=\"Rahmendämmung\",Daten!D$10,\"-\")))","v":""},{"$f":"IF(B71=0,\"\",IF(AND(C71=\"Ja\",Daten!D$15=TRUE),Daten!D$16,\"-\"))","v":""},{"$f":"IF(AN71=\"\",\"\",IF(AND(C71=\"Ja\",Daten!D$15=TRUE),Daten!D$18,\"-\"))","v":""},{"$f":"IF(B71=0,\"\",IF(Daten!H$7=TRUE,\"bauseits\",IF(Daten!H$8=TRUE,\"FSP 40\",\"WSP 40\")))","v":""},{"$f":"IF(B71=0,\"\",Daten!H$10)","v":""},{"$f":"IFERROR(IF(B71=0,\"\",IF(Daten!H$2=TRUE,1,0)*IF(J71+P71+P71+Q71+Q71>Daten!B$62,0,1)*IF(K71+P71+Z71+AF71+10>Daten!B$62,0,1)),0)","v":""}]
[null,null,{"$f":"IF(A72=\"\",\"\",IF(Daten!D$1<>\"Keine\",\"Ja\",\"Nein\"))","v":""},{"$f":"IF(A72=\"\",\"\",IF(Daten!B$4=TRUE,\"QB\",\"BS\")&IF(AR72=1,\"G\",\"\")&IF(C72=\"Nein\",\"-V\",IF(Daten!D$11=TRUE,\"-S\",\"-H\"))&IF(Daten!B$1=TRUE,\"-E\",\"\")&IF(Daten!F$9=TRUE,\"-B\",\"\")&IF(Daten!F$8=TRUE,\"A\",\"\"))","v":""},{"$f":"IF(A72=\"\",\"\",IFERROR(VLOOKUP(D72,Daten!D$43:G$94,2,FALSE),\"spez.\"))","v":""},null,null,null,null,{"$f":"IF(F72<>\"\",F72+(2*(Daten!B$13+2)),IF(H72<>\"\",H72-10,\"\"))","v":""},{"$f":"IFERROR(IF(G72<>\"\",G72+Daten!B$14+Daten!B$15+2+IF(AG72=\"-\",0,AG72),IF(I72<>\"\",I72-5,\"\")),\"\")","v":""},{"$f":"IF(B72=0,\"\",IF(L$1=0,0,Daten!B$10))","v":""},{"$f":"IF(B72=0,\"\",IF(M$1=0,0,Daten!B$11))","v":""},{"$f":"IF(B72=0,\"\",IF(N$1=0,0,Daten!B$12))","v":""},"",{"$f":"IF(B72=0,\"\",Daten!B$6)","v":""},{"$f":"IF(B72=0,\"\",Daten!B$16)","v":""},{"$f":"IF(B72=0,\"\",IF(Daten!B$1=TRUE,Daten!B$17,\"-\"))","v":""},{"$f":"IF(B72=0,\"\",IF(C72=\"Nein\",\"-\",Daten!D$7))","v":""},{"$f":"IF(B72=\"\",\"\",IF(C72=\"Nein\",\"-\",IF(T$1=0,\"\",Daten!D$12)))","v":""},{"$f":"IF(B72=\"\",\"\",IF(C72=\"Nein\",\"-\",IF(T$1=0,\"\",Daten!D$13)))","v":""},{"$f":"IF(B72=\"\",\"\",IF(C72=\"Nein\",\"-\",IF(T$1=0,\"\",IF(AK72=\"\",\"\",AK72+X72-Daten!D$20))))","v":""},{"$f":"IF(B72=0,\"\",IF(L$1=1,M72+N72,Daten!D$2))","v":""},{"$f":"IF(B72=0,\"\",IF(C72=\"Nein\",\"-\",Daten!D$6))","v":""},{"$f":"IF(B72=0,\"\",IF(C72=\"Nein\",\"-\",Daten!D$3))","v":""},{"$f":"IF(B72=0,\"\",Daten!D$4)","v":""},{"$f":"IF(B72=0,\"\",IF(C72=\"Nein\",\"-\",Daten!D$5))","v":""},{"$f":"IF(B72=0,\"\",IF(Daten!F$1=\"Keine\",Daten!A$45,IF(Daten!F$7=TRUE,Daten!A$48,Daten!A$44)))","v":""},{"$f":"IF(B72=0,\"\",IF(AB72=\"Standard\",IF(Daten!F$9=TRUE,1,0),0))","v":""},"",{"$f":"IF(B72=0,\"\",IF(OR(AB72=Daten!A$46,AB72=Daten!A$47,AB72=Daten!A$48),AI72+W72,\"-\"))","v":""},{"$f":"IF(B72=0,\"\",IF(AB72=Daten!A$45,\"-\",Daten!F$5))","v":""},{"$f":"IF(B72=0,\"\",IF(AB72=Daten!A$45,\"-\",Daten!F$4))","v":""},{"$f":"IF(B72=0,\"\",IF(AB72=Daten!A$45,\"-\",Daten!F$6))","v":""},{"$f":"IF(B72=0,\"\",IF(AB72=Daten!A$45,\"-\",Daten!F$2))","v":""},{"$f":"IF(B72=0,\"\",IF(AB72=Daten!A$45,\"-\",Daten!F$3))","v":""},"",{"$f":"IF(B72=0,\"\",IF(OR(C72=\"Nein\",Daten!D65=\"Ohne\"),\"-\",Daten!D$9))","v":""},{"$f":"IF(B72=0,\"\",IF(OR(C72=\"Nein\",Daten!D65=\"Ohne\"),\"-\",IF(Daten!D$8=\"Rahmendämmung\",Daten!D$10,\"-\")))","v":""},{"$f":"IF(B72=0,\"\",IF(AND(C72=\"Ja\",Daten!D$15=TRUE),Daten!D$16,\"-\"))","v":""},{"$f":"IF(AN72=\"\",\"\",IF(AND(C72=\"Ja\",Daten!D$15=TRUE),Daten!D$18,\"-\"))","v":""},{"$f":"IF(B72=0,\"\",IF(Daten!H$7=TRUE,\"bauseits\",IF(Daten!H$8=TRUE,\"FSP 40\",\"WSP 40\")))","v":""},{"$f":"IF(B72=0,\"\",Daten!H$10)","v":""},{"$f":"IFERROR(IF(B72=0,\"\",IF(Daten!H$2=TRUE,1,0)*IF(J72+P72+P72+Q72+Q72>Daten!B$62,0,1)*IF(K72+P72+Z72+AF72+10>Daten!B$62,0,1)),0)","v":""}]
[null,null,{"$f":"IF(A73=\"\",\"\",IF(Daten!D$1<>\"Keine\",\"Ja\",\"Nein\"))","v":""},{"$f":"IF(A73=\"\",\"\",IF(Daten!B$4=TRUE,\"QB\",\"BS\")&IF(AR73=1,\"G\",\"\")&IF(C73=\"Nein\",\"-V\",IF(Daten!D$11=TRUE,\"-S\",\"-H\"))&IF(Daten!B$1=TRUE,\"-E\",\"\")&IF(Daten!F$9=TRUE,\"-B\",\"\")&IF(Daten!F$8=TRUE,\"A\",\"\"))","v":""},{"$f":"IF(A73=\"\",\"\",IFERROR(VLOOKUP(D73,Daten!D$43:G$94,2,FALSE),\"spez.\"))","v":""},null,null,null,null,{"$f":"IF(F73<>\"\",F73+(2*(Daten!B$13+2)),IF(H73<>\"\",H73-10,\"\"))","v":""},{"$f":"IFERROR(IF(G73<>\"\",G73+Daten!B$14+Daten!B$15+2+IF(AG73=\"-\",0,AG73),IF(I73<>\"\",I73-5,\"\")),\"\")","v":""},{"$f":"IF(B73=0,\"\",IF(L$1=0,0,Daten!B$10))","v":""},{"$f":"IF(B73=0,\"\",IF(M$1=0,0,Daten!B$11))","v":""},{"$f":"IF(B73=0,\"\",IF(N$1=0,0,Daten!B$12))","v":""},"",{"$f":"IF(B73=0,\"\",Daten!B$6)","v":""},{"$f":"IF(B73=0,\"\",Daten!B$16)","v":""},{"$f":"IF(B73=0,\"\",IF(Daten!B$1=TRUE,Daten!B$17,\"-\"))","v":""},{"$f":"IF(B73=0,\"\",IF(C73=\"Nein\",\"-\",Daten!D$7))","v":""},{"$f":"IF(B73=\"\",\"\",IF(C73=\"Nein\",\"-\",IF(T$1=0,\"\",Daten!D$12)))","v":""},{"$f":"IF(B73=\"\",\"\",IF(C73=\"Nein\",\"-\",IF(T$1=0,\"\",Daten!D$13)))","v":""},{"$f":"IF(B73=\"\",\"\",IF(C73=\"Nein\",\"-\",IF(T$1=0,\"\",IF(AK73=\"\",\"\",AK73+X73-Daten!D$20))))","v":""},{"$f":"IF(B73=0,\"\",IF(L$1=1,M73+N73,Daten!D$2))","v":""},{"$f":"IF(B73=0,\"\",IF(C73=\"Nein\",\"-\",Daten!D$6))","v":""},{"$f":"IF(B73=0,\"\",IF(C73=\"Nein\",\"-\",Daten!D$3))","v":""},{"$f":"IF(B73=0,\"\",Daten!D$4)","v":""},{"$f":"IF(B73=0,\"\",IF(C73=\"Nein\",\"-\",Daten!D$5))","v":""},{"$f":"IF(B73=0,\"\",IF(Daten!F$1=\"Keine\",Daten!A$45,IF(Daten!F$7=TRUE,Daten!A$48,Daten!A$44)))","v":""},{"$f":"IF(B73=0,\"\",IF(AB73=\"Standard\",IF(Daten!F$9=TRUE,1,0),0))","v":""},"",{"$f":"IF(B73=0,\"\",IF(OR(AB73=Daten!A$46,AB73=Daten!A$47,AB73=Daten!A$48),AI73+W73,\"-\"))","v":""},{"$f":"IF(B73=0,\"\",IF(AB73=Daten!A$45,\"-\",Daten!F$5))","v":""},{"$f":"IF(B73=0,\"\",IF(AB73=Daten!A$45,\"-\",Daten!F$4))","v":""},{"$f":"IF(B73=0,\"\",IF(AB73=Daten!A$45,\"-\",Daten!F$6))","v":""},{"$f":"IF(B73=0,\"\",IF(AB73=Daten!A$45,\"-\",Daten!F$2))","v":""},{"$f":"IF(B73=0,\"\",IF(AB73=Daten!A$45,\"-\",Daten!F$3))","v":""},"",{"$f":"IF(B73=0,\"\",IF(OR(C73=\"Nein\",Daten!D78=\"Ohne\"),\"-\",Daten!D$9))","v":""},{"$f":"IF(B73=0,\"\",IF(OR(C73=\"Nein\",Daten!D78=\"Ohne\"),\"-\",IF(Daten!D$8=\"Rahmendämmung\",Daten!D$10,\"-\")))","v":""},{"$f":"IF(B73=0,\"\",IF(AND(C73=\"Ja\",Daten!D$15=TRUE),Daten!D$16,\"-\"))","v":""},{"$f":"IF(AN73=\"\",\"\",IF(AND(C73=\"Ja\",Daten!D$15=TRUE),Daten!D$18,\"-\"))","v":""},{"$f":"IF(B73=0,\"\",IF(Daten!H$7=TRUE,\"bauseits\",IF(Daten!H$8=TRUE,\"FSP 40\",\"WSP 40\")))","v":""},{"$f":"IF(B73=0,\"\",Daten!H$10)","v":""},{"$f":"IFERROR(IF(B73=0,\"\",IF(Daten!H$2=TRUE,1,0)*IF(J73+P73+P73+Q73+Q73>Daten!B$62,0,1)*IF(K73+P73+Z73+AF73+10>Daten!B$62,0,1)),0)","v":""}]
[null,null,{"$f":"IF(A74=\"\",\"\",IF(Daten!D$1<>\"Keine\",\"Ja\",\"Nein\"))","v":""},{"$f":"IF(A74=\"\",\"\",IF(Daten!B$4=TRUE,\"QB\",\"BS\")&IF(AR74=1,\"G\",\"\")&IF(C74=\"Nein\",\"-V\",IF(Daten!D$11=TRUE,\"-S\",\"-H\"))&IF(Daten!B$1=TRUE,\"-E\",\"\")&IF(Daten!F$9=TRUE,\"-B\",\"\")&IF(Daten!F$8=TRUE,\"A\",\"\"))","v":""},{"$f":"IF(A74=\"\",\"\",IFERROR(VLOOKUP(D74,Daten!D$43:G$94,2,FALSE),\"spez.\"))","v":""},null,null,null,null,{"$f":"IF(F74<>\"\",F74+(2*(Daten!B$13+2)),IF(H74<>\"\",H74-10,\"\"))","v":""},{"$f":"IFERROR(IF(G74<>\"\",G74+Daten!B$14+Daten!B$15+2+IF(AG74=\"-\",0,AG74),IF(I74<>\"\",I74-5,\"\")),\"\")","v":""},{"$f":"IF(B74=0,\"\",IF(L$1=0,0,Daten!B$10))","v":""},{"$f":"IF(B74=0,\"\",IF(M$1=0,0,Daten!B$11))","v":""},{"$f":"IF(B74=0,\"\",IF(N$1=0,0,Daten!B$12))","v":""},"",{"$f":"IF(B74=0,\"\",Daten!B$6)","v":""},{"$f":"IF(B74=0,\"\",Daten!B$16)","v":""},{"$f":"IF(B74=0,\"\",IF(Daten!B$1=TRUE,Daten!B$17,\"-\"))","v":""},{"$f":"IF(B74=0,\"\",IF(C74=\"Nein\",\"-\",Daten!D$7))","v":""},{"$f":"IF(B74=\"\",\"\",IF(C74=\"Nein\",\"-\",IF(T$1=0,\"\",Daten!D$12)))","v":""},{"$f":"IF(B74=\"\",\"\",IF(C74=\"Nein\",\"-\",IF(T$1=0,\"\",Daten!D$13)))","v":""},{"$f":"IF(B74=\"\",\"\",IF(C74=\"Nein\",\"-\",IF(T$1=0,\"\",IF(AK74=\"\",\"\",AK74+X74-Daten!D$20))))","v":""},{"$f":"IF(B74=0,\"\",IF(L$1=1,M74+N74,Daten!D$2))","v":""},{"$f":"IF(B74=0,\"\",IF(C74=\"Nein\",\"-\",Daten!D$6))","v":""},{"$f":"IF(B74=0,\"\",IF(C74=\"Nein\",\"-\",Daten!D$3))","v":""},{"$f":"IF(B74=0,\"\",Daten!D$4)","v":""},{"$f":"IF(B74=0,\"\",IF(C74=\"Nein\",\"-\",Daten!D$5))","v":""},{"$f":"IF(B74=0,\"\",IF(Daten!F$1=\"Keine\",Daten!A$45,IF(Daten!F$7=TRUE,Daten!A$48,Daten!A$44)))","v":""},{"$f":"IF(B74=0,\"\",IF(AB74=\"Standard\",IF(Daten!F$9=TRUE,1,0),0))","v":""},"",{"$f":"IF(B74=0,\"\",IF(OR(AB74=Daten!A$46,AB74=Daten!A$47,AB74=Daten!A$48),AI74+W74,\"-\"))","v":""},{"$f":"IF(B74=0,\"\",IF(AB74=Daten!A$45,\"-\",Daten!F$5))","v":""},{"$f":"IF(B74=0,\"\",IF(AB74=Daten!A$45,\"-\",Daten!F$4))","v":""},{"$f":"IF(B74=0,\"\",IF(AB74=Daten!A$45,\"-\",Daten!F$6))","v":""},{"$f":"IF(B74=0,\"\",IF(AB74=Daten!A$45,\"-\",Daten!F$2))","v":""},{"$f":"IF(B74=0,\"\",IF(AB74=Daten!A$45,\"-\",Daten!F$3))","v":""},"",{"$f":"IF(B74=0,\"\",IF(OR(C74=\"Nein\",Daten!D79=\"Ohne\"),\"-\",Daten!D$9))","v":""},{"$f":"IF(B74=0,\"\",IF(OR(C74=\"Nein\",Daten!D79=\"Ohne\"),\"-\",IF(Daten!D$8=\"Rahmendämmung\",Daten!D$10,\"-\")))","v":""},{"$f":"IF(B74=0,\"\",IF(AND(C74=\"Ja\",Daten!D$15=TRUE),Daten!D$16,\"-\"))","v":""},{"$f":"IF(AN74=\"\",\"\",IF(AND(C74=\"Ja\",Daten!D$15=TRUE),Daten!D$18,\"-\"))","v":""},{"$f":"IF(B74=0,\"\",IF(Daten!H$7=TRUE,\"bauseits\",IF(Daten!H$8=TRUE,\"FSP 40\",\"WSP 40\")))","v":""},{"$f":"IF(B74=0,\"\",Daten!H$10)","v":""},{"$f":"IFERROR(IF(B74=0,\"\",IF(Daten!H$2=TRUE,1,0)*IF(J74+P74+P74+Q74+Q74>Daten!B$62,0,1)*IF(K74+P74+Z74+AF74+10>Daten!B$62,0,1)),0)","v":""}]
[null,null,{"$f":"IF(A75=\"\",\"\",IF(Daten!D$1<>\"Keine\",\"Ja\",\"Nein\"))","v":""},{"$f":"IF(A75=\"\",\"\",IF(Daten!B$4=TRUE,\"QB\",\"BS\")&IF(AR75=1,\"G\",\"\")&IF(C75=\"Nein\",\"-V\",IF(Daten!D$11=TRUE,\"-S\",\"-H\"))&IF(Daten!B$1=TRUE,\"-E\",\"\")&IF(Daten!F$9=TRUE,\"-B\",\"\")&IF(Daten!F$8=TRUE,\"A\",\"\"))","v":""},{"$f":"IF(A75=\"\",\"\",IFERROR(VLOOKUP(D75,Daten!D$43:G$94,2,FALSE),\"spez.\"))","v":""},null,null,null,null,{"$f":"IF(F75<>\"\",F75+(2*(Daten!B$13+2)),IF(H75<>\"\",H75-10,\"\"))","v":""},{"$f":"IFERROR(IF(G75<>\"\",G75+Daten!B$14+Daten!B$15+2+IF(AG75=\"-\",0,AG75),IF(I75<>\"\",I75-5,\"\")),\"\")","v":""},{"$f":"IF(B75=0,\"\",IF(L$1=0,0,Daten!B$10))","v":""},{"$f":"IF(B75=0,\"\",IF(M$1=0,0,Daten!B$11))","v":""},{"$f":"IF(B75=0,\"\",IF(N$1=0,0,Daten!B$12))","v":""},"",{"$f":"IF(B75=0,\"\",Daten!B$6)","v":""},{"$f":"IF(B75=0,\"\",Daten!B$16)","v":""},{"$f":"IF(B75=0,\"\",IF(Daten!B$1=TRUE,Daten!B$17,\"-\"))","v":""},{"$f":"IF(B75=0,\"\",IF(C75=\"Nein\",\"-\",Daten!D$7))","v":""},{"$f":"IF(B75=\"\",\"\",IF(C75=\"Nein\",\"-\",IF(T$1=0,\"\",Daten!D$12)))","v":""},{"$f":"IF(B75=\"\",\"\",IF(C75=\"Nein\",\"-\",IF(T$1=0,\"\",Daten!D$13)))","v":""},{"$f":"IF(B75=\"\",\"\",IF(C75=\"Nein\",\"-\",IF(T$1=0,\"\",IF(AK75=\"\",\"\",AK75+X75-Daten!D$20))))","v":""},{"$f":"IF(B75=0,\"\",IF(L$1=1,M75+N75,Daten!D$2))","v":""},{"$f":"IF(B75=0,\"\",IF(C75=\"Nein\",\"-\",Daten!D$6))","v":""},{"$f":"IF(B75=0,\"\",IF(C75=\"Nein\",\"-\",Daten!D$3))","v":""},{"$f":"IF(B75=0,\"\",Daten!D$4)","v":""},{"$f":"IF(B75=0,\"\",IF(C75=\"Nein\",\"-\",Daten!D$5))","v":""},{"$f":"IF(B75=0,\"\",IF(Daten!F$1=\"Keine\",Daten!A$45,IF(Daten!F$7=TRUE,Daten!A$48,Daten!A$44)))","v":""},{"$f":"IF(B75=0,\"\",IF(AB75=\"Standard\",IF(Daten!F$9=TRUE,1,0),0))","v":""},"",{"$f":"IF(B75=0,\"\",IF(OR(AB75=Daten!A$46,AB75=Daten!A$47,AB75=Daten!A$48),AI75+W75,\"-\"))","v":""},{"$f":"IF(B75=0,\"\",IF(AB75=Daten!A$45,\"-\",Daten!F$5))","v":""},{"$f":"IF(B75=0,\"\",IF(AB75=Daten!A$45,\"-\",Daten!F$4))","v":""},{"$f":"IF(B75=0,\"\",IF(AB75=Daten!A$45,\"-\",Daten!F$6))","v":""},{"$f":"IF(B75=0,\"\",IF(AB75=Daten!A$45,\"-\",Daten!F$2))","v":""},{"$f":"IF(B75=0,\"\",IF(AB75=Daten!A$45,\"-\",Daten!F$3))","v":""},"",{"$f":"IF(B75=0,\"\",IF(OR(C75=\"Nein\",Daten!D80=\"Ohne\"),\"-\",Daten!D$9))","v":""},{"$f":"IF(B75=0,\"\",IF(OR(C75=\"Nein\",Daten!D80=\"Ohne\"),\"-\",IF(Daten!D$8=\"Rahmendämmung\",Daten!D$10,\"-\")))","v":""},{"$f":"IF(B75=0,\"\",IF(AND(C75=\"Ja\",Daten!D$15=TRUE),Daten!D$16,\"-\"))","v":""},{"$f":"IF(AN75=\"\",\"\",IF(AND(C75=\"Ja\",Daten!D$15=TRUE),Daten!D$18,\"-\"))","v":""},{"$f":"IF(B75=0,\"\",IF(Daten!H$7=TRUE,\"bauseits\",IF(Daten!H$8=TRUE,\"FSP 40\",\"WSP 40\")))","v":""},{"$f":"IF(B75=0,\"\",Daten!H$10)","v":""},{"$f":"IFERROR(IF(B75=0,\"\",IF(Daten!H$2=TRUE,1,0)*IF(J75+P75+P75+Q75+Q75>Daten!B$62,0,1)*IF(K75+P75+Z75+AF75+10>Daten!B$62,0,1)),0)","v":""}]
[null,null,{"$f":"IF(A76=\"\",\"\",IF(Daten!D$1<>\"Keine\",\"Ja\",\"Nein\"))","v":""},{"$f":"IF(A76=\"\",\"\",IF(Daten!B$4=TRUE,\"QB\",\"BS\")&IF(AR76=1,\"G\",\"\")&IF(C76=\"Nein\",\"-V\",IF(Daten!D$11=TRUE,\"-S\",\"-H\"))&IF(Daten!B$1=TRUE,\"-E\",\"\")&IF(Daten!F$9=TRUE,\"-B\",\"\")&IF(Daten!F$8=TRUE,\"A\",\"\"))","v":""},{"$f":"IF(A76=\"\",\"\",IFERROR(VLOOKUP(D76,Daten!D$43:G$94,2,FALSE),\"spez.\"))","v":""},null,null,null,null,{"$f":"IF(F76<>\"\",F76+(2*(Daten!B$13+2)),IF(H76<>\"\",H76-10,\"\"))","v":""},{"$f":"IFERROR(IF(G76<>\"\",G76+Daten!B$14+Daten!B$15+2+IF(AG76=\"-\",0,AG76),IF(I76<>\"\",I76-5,\"\")),\"\")","v":""},{"$f":"IF(B76=0,\"\",IF(L$1=0,0,Daten!B$10))","v":""},{"$f":"IF(B76=0,\"\",IF(M$1=0,0,Daten!B$11))","v":""},{"$f":"IF(B76=0,\"\",IF(N$1=0,0,Daten!B$12))","v":""},"",{"$f":"IF(B76=0,\"\",Daten!B$6)","v":""},{"$f":"IF(B76=0,\"\",Daten!B$16)","v":""},{"$f":"IF(B76=0,\"\",IF(Daten!B$1=TRUE,Daten!B$17,\"-\"))","v":""},{"$f":"IF(B76=0,\"\",IF(C76=\"Nein\",\"-\",Daten!D$7))","v":""},{"$f":"IF(B76=\"\",\"\",IF(C76=\"Nein\",\"-\",IF(T$1=0,\"\",Daten!D$12)))","v":""},{"$f":"IF(B76=\"\",\"\",IF(C76=\"Nein\",\"-\",IF(T$1=0,\"\",Daten!D$13)))","v":""},{"$f":"IF(B76=\"\",\"\",IF(C76=\"Nein\",\"-\",IF(T$1=0,\"\",IF(AK76=\"\",\"\",AK76+X76-Daten!D$20))))","v":""},{"$f":"IF(B76=0,\"\",IF(L$1=1,M76+N76,Daten!D$2))","v":""},{"$f":"IF(B76=0,\"\",IF(C76=\"Nein\",\"-\",Daten!D$6))","v":""},{"$f":"IF(B76=0,\"\",IF(C76=\"Nein\",\"-\",Daten!D$3))","v":""},{"$f":"IF(B76=0,\"\",Daten!D$4)","v":""},{"$f":"IF(B76=0,\"\",IF(C76=\"Nein\",\"-\",Daten!D$5))","v":""},{"$f":"IF(B76=0,\"\",IF(Daten!F$1=\"Keine\",Daten!A$45,IF(Daten!F$7=TRUE,Daten!A$48,Daten!A$44)))","v":""},{"$f":"IF(B76=0,\"\",IF(AB76=\"Standard\",IF(Daten!F$9=TRUE,1,0),0))","v":""},"",{"$f":"IF(B76=0,\"\",IF(OR(AB76=Daten!A$46,AB76=Daten!A$47,AB76=Daten!A$48),AI76+W76,\"-\"))","v":""},{"$f":"IF(B76=0,\"\",IF(AB76=Daten!A$45,\"-\",Daten!F$5))","v":""},{"$f":"IF(B76=0,\"\",IF(AB76=Daten!A$45,\"-\",Daten!F$4))","v":""},{"$f":"IF(B76=0,\"\",IF(AB76=Daten!A$45,\"-\",Daten!F$6))","v":""},{"$f":"IF(B76=0,\"\",IF(AB76=Daten!A$45,\"-\",Daten!F$2))","v":""},{"$f":"IF(B76=0,\"\",IF(AB76=Daten!A$45,\"-\",Daten!F$3))","v":""},"",{"$f":"IF(B76=0,\"\",IF(OR(C76=\"Nein\",Daten!D81=\"Ohne\"),\"-\",Daten!D$9))","v":""},{"$f":"IF(B76=0,\"\",IF(OR(C76=\"Nein\",Daten!D81=\"Ohne\"),\"-\",IF(Daten!D$8=\"Rahmendämmung\",Daten!D$10,\"-\")))","v":""},{"$f":"IF(B76=0,\"\",IF(AND(C76=\"Ja\",Daten!D$15=TRUE),Daten!D$16,\"-\"))","v":""},{"$f":"IF(AN76=\"\",\"\",IF(AND(C76=\"Ja\",Daten!D$15=TRUE),Daten!D$18,\"-\"))","v":""},{"$f":"IF(B76=0,\"\",IF(Daten!H$7=TRUE,\"bauseits\",IF(Daten!H$8=TRUE,\"FSP 40\",\"WSP 40\")))","v":""},{"$f":"IF(B76=0,\"\",Daten!H$10)","v":""},{"$f":"IFERROR(IF(B76=0,\"\",IF(Daten!H$2=TRUE,1,0)*IF(J76+P76+P76+Q76+Q76>Daten!B$62,0,1)*IF(K76+P76+Z76+AF76+10>Daten!B$62,0,1)),0)","v":""}]
[null,null,{"$f":"IF(A77=\"\",\"\",IF(Daten!D$1<>\"Keine\",\"Ja\",\"Nein\"))","v":""},{"$f":"IF(A77=\"\",\"\",IF(Daten!B$4=TRUE,\"QB\",\"BS\")&IF(AR77=1,\"G\",\"\")&IF(C77=\"Nein\",\"-V\",IF(Daten!D$11=TRUE,\"-S\",\"-H\"))&IF(Daten!B$1=TRUE,\"-E\",\"\")&IF(Daten!F$9=TRUE,\"-B\",\"\")&IF(Daten!F$8=TRUE,\"A\",\"\"))","v":""},{"$f":"IF(A77=\"\",\"\",IFERROR(VLOOKUP(D77,Daten!D$43:G$94,2,FALSE),\"spez.\"))","v":""},null,null,null,null,{"$f":"IF(F77<>\"\",F77+(2*(Daten!B$13+2)),IF(H77<>\"\",H77-10,\"\"))","v":""},{"$f":"IFERROR(IF(G77<>\"\",G77+Daten!B$14+Daten!B$15+2+IF(AG77=\"-\",0,AG77),IF(I77<>\"\",I77-5,\"\")),\"\")","v":""},{"$f":"IF(B77=0,\"\",IF(L$1=0,0,Daten!B$10))","v":""},{"$f":"IF(B77=0,\"\",IF(M$1=0,0,Daten!B$11))","v":""},{"$f":"IF(B77=0,\"\",IF(N$1=0,0,Daten!B$12))","v":""},"",{"$f":"IF(B77=0,\"\",Daten!B$6)","v":""},{"$f":"IF(B77=0,\"\",Daten!B$16)","v":""},{"$f":"IF(B77=0,\"\",IF(Daten!B$1=TRUE,Daten!B$17,\"-\"))","v":""},{"$f":"IF(B77=0,\"\",IF(C77=\"Nein\",\"-\",Daten!D$7))","v":""},{"$f":"IF(B77=\"\",\"\",IF(C77=\"Nein\",\"-\",IF(T$1=0,\"\",Daten!D$12)))","v":""},{"$f":"IF(B77=\"\",\"\",IF(C77=\"Nein\",\"-\",IF(T$1=0,\"\",Daten!D$13)))","v":""},{"$f":"IF(B77=\"\",\"\",IF(C77=\"Nein\",\"-\",IF(T$1=0,\"\",IF(AK77=\"\",\"\",AK77+X77-Daten!D$20))))","v":""},{"$f":"IF(B77=0,\"\",IF(L$1=1,M77+N77,Daten!D$2))","v":""},{"$f":"IF(B77=0,\"\",IF(C77=\"Nein\",\"-\",Daten!D$6))","v":""},{"$f":"IF(B77=0,\"\",IF(C77=\"Nein\",\"-\",Daten!D$3))","v":""},{"$f":"IF(B77=0,\"\",Daten!D$4)","v":""},{"$f":"IF(B77=0,\"\",IF(C77=\"Nein\",\"-\",Daten!D$5))","v":""},{"$f":"IF(B77=0,\"\",IF(Daten!F$1=\"Keine\",Daten!A$45,IF(Daten!F$7=TRUE,Daten!A$48,Daten!A$44)))","v":""},{"$f":"IF(B77=0,\"\",IF(AB77=\"Standard\",IF(Daten!F$9=TRUE,1,0),0))","v":""},"",{"$f":"IF(B77=0,\"\",IF(OR(AB77=Daten!A$46,AB77=Daten!A$47,AB77=Daten!A$48),AI77+W77,\"-\"))","v":""},{"$f":"IF(B77=0,\"\",IF(AB77=Daten!A$45,\"-\",Daten!F$5))","v":""},{"$f":"IF(B77=0,\"\",IF(AB77=Daten!A$45,\"-\",Daten!F$4))","v":""},{"$f":"IF(B77=0,\"\",IF(AB77=Daten!A$45,\"-\",Daten!F$6))","v":""},{"$f":"IF(B77=0,\"\",IF(AB77=Daten!A$45,\"-\",Daten!F$2))","v":""},{"$f":"IF(B77=0,\"\",IF(AB77=Daten!A$45,\"-\",Daten!F$3))","v":""},"",{"$f":"IF(B77=0,\"\",IF(OR(C77=\"Nein\",Daten!D82=\"Ohne\"),\"-\",Daten!D$9))","v":""},{"$f":"IF(B77=0,\"\",IF(OR(C77=\"Nein\",Daten!D82=\"Ohne\"),\"-\",IF(Daten!D$8=\"Rahmendämmung\",Daten!D$10,\"-\")))","v":""},{"$f":"IF(B77=0,\"\",IF(AND(C77=\"Ja\",Daten!D$15=TRUE),Daten!D$16,\"-\"))","v":""},{"$f":"IF(AN77=\"\",\"\",IF(AND(C77=\"Ja\",Daten!D$15=TRUE),Daten!D$18,\"-\"))","v":""},{"$f":"IF(B77=0,\"\",IF(Daten!H$7=TRUE,\"bauseits\",IF(Daten!H$8=TRUE,\"FSP 40\",\"WSP 40\")))","v":""},{"$f":"IF(B77=0,\"\",Daten!H$10)","v":""},{"$f":"IFERROR(IF(B77=0,\"\",IF(Daten!H$2=TRUE,1,0)*IF(J77+P77+P77+Q77+Q77>Daten!B$62,0,1)*IF(K77+P77+Z77+AF77+10>Daten!B$62,0,1)),0)","v":""}]
[null,null,{"$f":"IF(A78=\"\",\"\",IF(Daten!D$1<>\"Keine\",\"Ja\",\"Nein\"))","v":""},{"$f":"IF(A78=\"\",\"\",IF(Daten!B$4=TRUE,\"QB\",\"BS\")&IF(AR78=1,\"G\",\"\")&IF(C78=\"Nein\",\"-V\",IF(Daten!D$11=TRUE,\"-S\",\"-H\"))&IF(Daten!B$1=TRUE,\"-E\",\"\")&IF(Daten!F$9=TRUE,\"-B\",\"\")&IF(Daten!F$8=TRUE,\"A\",\"\"))","v":""},{"$f":"IF(A78=\"\",\"\",IFERROR(VLOOKUP(D78,Daten!D$43:G$94,2,FALSE),\"spez.\"))","v":""},null,null,null,null,{"$f":"IF(F78<>\"\",F78+(2*(Daten!B$13+2)),IF(H78<>\"\",H78-10,\"\"))","v":""},{"$f":"IFERROR(IF(G78<>\"\",G78+Daten!B$14+Daten!B$15+2+IF(AG78=\"-\",0,AG78),IF(I78<>\"\",I78-5,\"\")),\"\")","v":""},{"$f":"IF(B78=0,\"\",IF(L$1=0,0,Daten!B$10))","v":""},{"$f":"IF(B78=0,\"\",IF(M$1=0,0,Daten!B$11))","v":""},{"$f":"IF(B78=0,\"\",IF(N$1=0,0,Daten!B$12))","v":""},"",{"$f":"IF(B78=0,\"\",Daten!B$6)","v":""},{"$f":"IF(B78=0,\"\",Daten!B$16)","v":""},{"$f":"IF(B78=0,\"\",IF(Daten!B$1=TRUE,Daten!B$17,\"-\"))","v":""},{"$f":"IF(B78=0,\"\",IF(C78=\"Nein\",\"-\",Daten!D$7))","v":""},{"$f":"IF(B78=\"\",\"\",IF(C78=\"Nein\",\"-\",IF(T$1=0,\"\",Daten!D$12)))","v":""},{"$f":"IF(B78=\"\",\"\",IF(C78=\"Nein\",\"-\",IF(T$1=0,\"\",Daten!D$13)))","v":""},{"$f":"IF(B78=\"\",\"\",IF(C78=\"Nein\",\"-\",IF(T$1=0,\"\",IF(AK78=\"\",\"\",AK78+X78-Daten!D$20))))","v":""},{"$f":"IF(B78=0,\"\",IF(L$1=1,M78+N78,Daten!D$2))","v":""},{"$f":"IF(B78=0,\"\",IF(C78=\"Nein\",\"-\",Daten!D$6))","v":""},{"$f":"IF(B78=0,\"\",IF(C78=\"Nein\",\"-\",Daten!D$3))","v":""},{"$f":"IF(B78=0,\"\",Daten!D$4)","v":""},{"$f":"IF(B78=0,\"\",IF(C78=\"Nein\",\"-\",Daten!D$5))","v":""},{"$f":"IF(B78=0,\"\",IF(Daten!F$1=\"Keine\",Daten!A$45,IF(Daten!F$7=TRUE,Daten!A$48,Daten!A$44)))","v":""},{"$f":"IF(B78=0,\"\",IF(AB78=\"Standard\",IF(Daten!F$9=TRUE,1,0),0))","v":""},"",{"$f":"IF(B78=0,\"\",IF(OR(AB78=Daten!A$46,AB78=Daten!A$47,AB78=Daten!A$48),AI78+W78,\"-\"))","v":""},{"$f":"IF(B78=0,\"\",IF(AB78=Daten!A$45,\"-\",Daten!F$5))","v":""},{"$f":"IF(B78=0,\"\",IF(AB78=Daten!A$45,\"-\",Daten!F$4))","v":""},{"$f":"IF(B78=0,\"\",IF(AB78=Daten!A$45,\"-\",Daten!F$6))","v":""},{"$f":"IF(B78=0,\"\",IF(AB78=Daten!A$45,\"-\",Daten!F$2))","v":""},{"$f":"IF(B78=0,\"\",IF(AB78=Daten!A$45,\"-\",Daten!F$3))","v":""},"",{"$f":"IF(B78=0,\"\",IF(OR(C78=\"Nein\",Daten!D83=\"Ohne\"),\"-\",Daten!D$9))","v":""},{"$f":"IF(B78=0,\"\",IF(OR(C78=\"Nein\",Daten!D83=\"Ohne\"),\"-\",IF(Daten!D$8=\"Rahmendämmung\",Daten!D$10,\"-\")))","v":""},{"$f":"IF(B78=0,\"\",IF(AND(C78=\"Ja\",Daten!D$15=TRUE),Daten!D$16,\"-\"))","v":""},{"$f":"IF(AN78=\"\",\"\",IF(AND(C78=\"Ja\",Daten!D$15=TRUE),Daten!D$18,\"-\"))","v":""},{"$f":"IF(B78=0,\"\",IF(Daten!H$7=TRUE,\"bauseits\",IF(Daten!H$8=TRUE,\"FSP 40\",\"WSP 40\")))","v":""},{"$f":"IF(B78=0,\"\",Daten!H$10)","v":""},{"$f":"IFERROR(IF(B78=0,\"\",IF(Daten!H$2=TRUE,1,0)*IF(J78+P78+P78+Q78+Q78>Daten!B$62,0,1)*IF(K78+P78+Z78+AF78+10>Daten!B$62,0,1)),0)","v":""}]
[null,null,{"$f":"IF(A79=\"\",\"\",IF(Daten!D$1<>\"Keine\",\"Ja\",\"Nein\"))","v":""},{"$f":"IF(A79=\"\",\"\",IF(Daten!B$4=TRUE,\"QB\",\"BS\")&IF(AR79=1,\"G\",\"\")&IF(C79=\"Nein\",\"-V\",IF(Daten!D$11=TRUE,\"-S\",\"-H\"))&IF(Daten!B$1=TRUE,\"-E\",\"\")&IF(Daten!F$9=TRUE,\"-B\",\"\")&IF(Daten!F$8=TRUE,\"A\",\"\"))","v":""},{"$f":"IF(A79=\"\",\"\",IFERROR(VLOOKUP(D79,Daten!D$43:G$94,2,FALSE),\"spez.\"))","v":""},null,null,null,null,{"$f":"IF(F79<>\"\",F79+(2*(Daten!B$13+2)),IF(H79<>\"\",H79-10,\"\"))","v":""},{"$f":"IFERROR(IF(G79<>\"\",G79+Daten!B$14+Daten!B$15+2+IF(AG79=\"-\",0,AG79),IF(I79<>\"\",I79-5,\"\")),\"\")","v":""},{"$f":"IF(B79=0,\"\",IF(L$1=0,0,Daten!B$10))","v":""},{"$f":"IF(B79=0,\"\",IF(M$1=0,0,Daten!B$11))","v":""},{"$f":"IF(B79=0,\"\",IF(N$1=0,0,Daten!B$12))","v":""},"",{"$f":"IF(B79=0,\"\",Daten!B$6)","v":""},{"$f":"IF(B79=0,\"\",Daten!B$16)","v":""},{"$f":"IF(B79=0,\"\",IF(Daten!B$1=TRUE,Daten!B$17,\"-\"))","v":""},{"$f":"IF(B79=0,\"\",IF(C79=\"Nein\",\"-\",Daten!D$7))","v":""},{"$f":"IF(B79=\"\",\"\",IF(C79=\"Nein\",\"-\",IF(T$1=0,\"\",Daten!D$12)))","v":""},{"$f":"IF(B79=\"\",\"\",IF(C79=\"Nein\",\"-\",IF(T$1=0,\"\",Daten!D$13)))","v":""},{"$f":"IF(B79=\"\",\"\",IF(C79=\"Nein\",\"-\",IF(T$1=0,\"\",IF(AK79=\"\",\"\",AK79+X79-Daten!D$20))))","v":""},{"$f":"IF(B79=0,\"\",IF(L$1=1,M79+N79,Daten!D$2))","v":""},{"$f":"IF(B79=0,\"\",IF(C79=\"Nein\",\"-\",Daten!D$6))","v":""},{"$f":"IF(B79=0,\"\",IF(C79=\"Nein\",\"-\",Daten!D$3))","v":""},{"$f":"IF(B79=0,\"\",Daten!D$4)","v":""},{"$f":"IF(B79=0,\"\",IF(C79=\"Nein\",\"-\",Daten!D$5))","v":""},{"$f":"IF(B79=0,\"\",IF(Daten!F$1=\"Keine\",Daten!A$45,IF(Daten!F$7=TRUE,Daten!A$48,Daten!A$44)))","v":""},{"$f":"IF(B79=0,\"\",IF(AB79=\"Standard\",IF(Daten!F$9=TRUE,1,0),0))","v":""},"",{"$f":"IF(B79=0,\"\",IF(OR(AB79=Daten!A$46,AB79=Daten!A$47,AB79=Daten!A$48),AI79+W79,\"-\"))","v":""},{"$f":"IF(B79=0,\"\",IF(AB79=Daten!A$45,\"-\",Daten!F$5))","v":""},{"$f":"IF(B79=0,\"\",IF(AB79=Daten!A$45,\"-\",Daten!F$4))","v":""},{"$f":"IF(B79=0,\"\",IF(AB79=Daten!A$45,\"-\",Daten!F$6))","v":""},{"$f":"IF(B79=0,\"\",IF(AB79=Daten!A$45,\"-\",Daten!F$2))","v":""},{"$f":"IF(B79=0,\"\",IF(AB79=Daten!A$45,\"-\",Daten!F$3))","v":""},"",{"$f":"IF(B79=0,\"\",IF(OR(C79=\"Nein\",Daten!D84=\"Ohne\"),\"-\",Daten!D$9))","v":""},{"$f":"IF(B79=0,\"\",IF(OR(C79=\"Nein\",Daten!D84=\"Ohne\"),\"-\",IF(Daten!D$8=\"Rahmendämmung\",Daten!D$10,\"-\")))","v":""},{"$f":"IF(B79=0,\"\",IF(AND(C79=\"Ja\",Daten!D$15=TRUE),Daten!D$16,\"-\"))","v":""},{"$f":"IF(AN79=\"\",\"\",IF(AND(C79=\"Ja\",Daten!D$15=TRUE),Daten!D$18,\"-\"))","v":""},{"$f":"IF(B79=0,\"\",IF(Daten!H$7=TRUE,\"bauseits\",IF(Daten!H$8=TRUE,\"FSP 40\",\"WSP 40\")))","v":""},{"$f":"IF(B79=0,\"\",Daten!H$10)","v":""},{"$f":"IFERROR(IF(B79=0,\"\",IF(Daten!H$2=TRUE,1,0)*IF(J79+P79+P79+Q79+Q79>Daten!B$62,0,1)*IF(K79+P79+Z79+AF79+10>Daten!B$62,0,1)),0)","v":""}]
[null,null,{"$f":"IF(A80=\"\",\"\",IF(Daten!D$1<>\"Keine\",\"Ja\",\"Nein\"))","v":""},{"$f":"IF(A80=\"\",\"\",IF(Daten!B$4=TRUE,\"QB\",\"BS\")&IF(AR80=1,\"G\",\"\")&IF(C80=\"Nein\",\"-V\",IF(Daten!D$11=TRUE,\"-S\",\"-H\"))&IF(Daten!B$1=TRUE,\"-E\",\"\")&IF(Daten!F$9=TRUE,\"-B\",\"\")&IF(Daten!F$8=TRUE,\"A\",\"\"))","v":""},{"$f":"IF(A80=\"\",\"\",IFERROR(VLOOKUP(D80,Daten!D$43:G$94,2,FALSE),\"spez.\"))","v":""},null,null,null,null,{"$f":"IF(F80<>\"\",F80+(2*(Daten!B$13+2)),IF(H80<>\"\",H80-10,\"\"))","v":""},{"$f":"IFERROR(IF(G80<>\"\",G80+Daten!B$14+Daten!B$15+2+IF(AG80=\"-\",0,AG80),IF(I80<>\"\",I80-5,\"\")),\"\")","v":""},{"$f":"IF(B80=0,\"\",IF(L$1=0,0,Daten!B$10))","v":""},{"$f":"IF(B80=0,\"\",IF(M$1=0,0,Daten!B$11))","v":""},{"$f":"IF(B80=0,\"\",IF(N$1=0,0,Daten!B$12))","v":""},"",{"$f":"IF(B80=0,\"\",Daten!B$6)","v":""},{"$f":"IF(B80=0,\"\",Daten!B$16)","v":""},{"$f":"IF(B80=0,\"\",IF(Daten!B$1=TRUE,Daten!B$17,\"-\"))","v":""},{"$f":"IF(B80=0,\"\",IF(C80=\"Nein\",\"-\",Daten!D$7))","v":""},{"$f":"IF(B80=\"\",\"\",IF(C80=\"Nein\",\"-\",IF(T$1=0,\"\",Daten!D$12)))","v":""},{"$f":"IF(B80=\"\",\"\",IF(C80=\"Nein\",\"-\",IF(T$1=0,\"\",Daten!D$13)))","v":""},{"$f":"IF(B80=\"\",\"\",IF(C80=\"Nein\",\"-\",IF(T$1=0,\"\",IF(AK80=\"\",\"\",AK80+X80-Daten!D$20))))","v":""},{"$f":"IF(B80=0,\"\",IF(L$1=1,M80+N80,Daten!D$2))","v":""},{"$f":"IF(B80=0,\"\",IF(C80=\"Nein\",\"-\",Daten!D$6))","v":""},{"$f":"IF(B80=0,\"\",IF(C80=\"Nein\",\"-\",Daten!D$3))","v":""},{"$f":"IF(B80=0,\"\",Daten!D$4)","v":""},{"$f":"IF(B80=0,\"\",IF(C80=\"Nein\",\"-\",Daten!D$5))","v":""},{"$f":"IF(B80=0,\"\",IF(Daten!F$1=\"Keine\",Daten!A$45,IF(Daten!F$7=TRUE,Daten!A$48,Daten!A$44)))","v":""},{"$f":"IF(B80=0,\"\",IF(AB80=\"Standard\",IF(Daten!F$9=TRUE,1,0),0))","v":""},"",{"$f":"IF(B80=0,\"\",IF(OR(AB80=Daten!A$46,AB80=Daten!A$47,AB80=Daten!A$48),AI80+W80,\"-\"))","v":""},{"$f":"IF(B80=0,\"\",IF(AB80=Daten!A$45,\"-\",Daten!F$5))","v":""},{"$f":"IF(B80=0,\"\",IF(AB80=Daten!A$45,\"-\",Daten!F$4))","v":""},{"$f":"IF(B80=0,\"\",IF(AB80=Daten!A$45,\"-\",Daten!F$6))","v":""},{"$f":"IF(B80=0,\"\",IF(AB80=Daten!A$45,\"-\",Daten!F$2))","v":""},{"$f":"IF(B80=0,\"\",IF(AB80=Daten!A$45,\"-\",Daten!F$3))","v":""},"",{"$f":"IF(B80=0,\"\",IF(OR(C80=\"Nein\",Daten!D85=\"Ohne\"),\"-\",Daten!D$9))","v":""},{"$f":"IF(B80=0,\"\",IF(OR(C80=\"Nein\",Daten!D85=\"Ohne\"),\"-\",IF(Daten!D$8=\"Rahmendämmung\",Daten!D$10,\"-\")))","v":""},{"$f":"IF(B80=0,\"\",IF(AND(C80=\"Ja\",Daten!D$15=TRUE),Daten!D$16,\"-\"))","v":""},{"$f":"IF(AN80=\"\",\"\",IF(AND(C80=\"Ja\",Daten!D$15=TRUE),Daten!D$18,\"-\"))","v":""},{"$f":"IF(B80=0,\"\",IF(Daten!H$7=TRUE,\"bauseits\",IF(Daten!H$8=TRUE,\"FSP 40\",\"WSP 40\")))","v":""},{"$f":"IF(B80=0,\"\",Daten!H$10)","v":""},{"$f":"IFERROR(IF(B80=0,\"\",IF(Daten!H$2=TRUE,1,0)*IF(J80+P80+P80+Q80+Q80>Daten!B$62,0,1)*IF(K80+P80+Z80+AF80+10>Daten!B$62,0,1)),0)","v":""}]
[null,null,{"$f":"IF(A81=\"\",\"\",IF(Daten!D$1<>\"Keine\",\"Ja\",\"Nein\"))","v":""},{"$f":"IF(A81=\"\",\"\",IF(Daten!B$4=TRUE,\"QB\",\"BS\")&IF(AR81=1,\"G\",\"\")&IF(C81=\"Nein\",\"-V\",IF(Daten!D$11=TRUE,\"-S\",\"-H\"))&IF(Daten!B$1=TRUE,\"-E\",\"\")&IF(Daten!F$9=TRUE,\"-B\",\"\")&IF(Daten!F$8=TRUE,\"A\",\"\"))","v":""},{"$f":"IF(A81=\"\",\"\",IFERROR(VLOOKUP(D81,Daten!D$43:G$94,2,FALSE),\"spez.\"))","v":""},null,null,null,null,{"$f":"IF(F81<>\"\",F81+(2*(Daten!B$13+2)),IF(H81<>\"\",H81-10,\"\"))","v":""},{"$f":"IFERROR(IF(G81<>\"\",G81+Daten!B$14+Daten!B$15+2+IF(AG81=\"-\",0,AG81),IF(I81<>\"\",I81-5,\"\")),\"\")","v":""},{"$f":"IF(B81=0,\"\",IF(L$1=0,0,Daten!B$10))","v":""},{"$f":"IF(B81=0,\"\",IF(M$1=0,0,Daten!B$11))","v":""},{"$f":"IF(B81=0,\"\",IF(N$1=0,0,Daten!B$12))","v":""},"",{"$f":"IF(B81=0,\"\",Daten!B$6)","v":""},{"$f":"IF(B81=0,\"\",Daten!B$16)","v":""},{"$f":"IF(B81=0,\"\",IF(Daten!B$1=TRUE,Daten!B$17,\"-\"))","v":""},{"$f":"IF(B81=0,\"\",IF(C81=\"Nein\",\"-\",Daten!D$7))","v":""},{"$f":"IF(B81=\"\",\"\",IF(C81=\"Nein\",\"-\",IF(T$1=0,\"\",Daten!D$12)))","v":""},{"$f":"IF(B81=\"\",\"\",IF(C81=\"Nein\",\"-\",IF(T$1=0,\"\",Daten!D$13)))","v":""},{"$f":"IF(B81=\"\",\"\",IF(C81=\"Nein\",\"-\",IF(T$1=0,\"\",IF(AK81=\"\",\"\",AK81+X81-Daten!D$20))))","v":""},{"$f":"IF(B81=0,\"\",IF(L$1=1,M81+N81,Daten!D$2))","v":""},{"$f":"IF(B81=0,\"\",IF(C81=\"Nein\",\"-\",Daten!D$6))","v":""},{"$f":"IF(B81=0,\"\",IF(C81=\"Nein\",\"-\",Daten!D$3))","v":""},{"$f":"IF(B81=0,\"\",Daten!D$4)","v":""},{"$f":"IF(B81=0,\"\",IF(C81=\"Nein\",\"-\",Daten!D$5))","v":""},{"$f":"IF(B81=0,\"\",IF(Daten!F$1=\"Keine\",Daten!A$45,IF(Daten!F$7=TRUE,Daten!A$48,Daten!A$44)))","v":""},{"$f":"IF(B81=0,\"\",IF(AB81=\"Standard\",IF(Daten!F$9=TRUE,1,0),0))","v":""},"",{"$f":"IF(B81=0,\"\",IF(OR(AB81=Daten!A$46,AB81=Daten!A$47,AB81=Daten!A$48),AI81+W81,\"-\"))","v":""},{"$f":"IF(B81=0,\"\",IF(AB81=Daten!A$45,\"-\",Daten!F$5))","v":""},{"$f":"IF(B81=0,\"\",IF(AB81=Daten!A$45,\"-\",Daten!F$4))","v":""},{"$f":"IF(B81=0,\"\",IF(AB81=Daten!A$45,\"-\",Daten!F$6))","v":""},{"$f":"IF(B81=0,\"\",IF(AB81=Daten!A$45,\"-\",Daten!F$2))","v":""},{"$f":"IF(B81=0,\"\",IF(AB81=Daten!A$45,\"-\",Daten!F$3))","v":""},"",{"$f":"IF(B81=0,\"\",IF(OR(C81=\"Nein\",Daten!D86=\"Ohne\"),\"-\",Daten!D$9))","v":""},{"$f":"IF(B81=0,\"\",IF(OR(C81=\"Nein\",Daten!D86=\"Ohne\"),\"-\",IF(Daten!D$8=\"Rahmendämmung\",Daten!D$10,\"-\")))","v":""},{"$f":"IF(B81=0,\"\",IF(AND(C81=\"Ja\",Daten!D$15=TRUE),Daten!D$16,\"-\"))","v":""},{"$f":"IF(AN81=\"\",\"\",IF(AND(C81=\"Ja\",Daten!D$15=TRUE),Daten!D$18,\"-\"))","v":""},{"$f":"IF(B81=0,\"\",IF(Daten!H$7=TRUE,\"bauseits\",IF(Daten!H$8=TRUE,\"FSP 40\",\"WSP 40\")))","v":""},{"$f":"IF(B81=0,\"\",Daten!H$10)","v":""},{"$f":"IFERROR(IF(B81=0,\"\",IF(Daten!H$2=TRUE,1,0)*IF(J81+P81+P81+Q81+Q81>Daten!B$62,0,1)*IF(K81+P81+Z81+AF81+10>Daten!B$62,0,1)),0)","v":""}]
[null,null,{"$f":"IF(A82=\"\",\"\",IF(Daten!D$1<>\"Keine\",\"Ja\",\"Nein\"))","v":""},{"$f":"IF(A82=\"\",\"\",IF(Daten!B$4=TRUE,\"QB\",\"BS\")&IF(AR82=1,\"G\",\"\")&IF(C82=\"Nein\",\"-V\",IF(Daten!D$11=TRUE,\"-S\",\"-H\"))&IF(Daten!B$1=TRUE,\"-E\",\"\")&IF(Daten!F$9=TRUE,\"-B\",\"\")&IF(Daten!F$8=TRUE,\"A\",\"\"))","v":""},{"$f":"IF(A82=\"\",\"\",IFERROR(VLOOKUP(D82,Daten!D$43:G$94,2,FALSE),\"spez.\"))","v":""},null,null,null,null,{"$f":"IF(F82<>\"\",F82+(2*(Daten!B$13+2)),IF(H82<>\"\",H82-10,\"\"))","v":""},{"$f":"IFERROR(IF(G82<>\"\",G82+Daten!B$14+Daten!B$15+2+IF(AG82=\"-\",0,AG82),IF(I82<>\"\",I82-5,\"\")),\"\")","v":""},{"$f":"IF(B82=0,\"\",IF(L$1=0,0,Daten!B$10))","v":""},{"$f":"IF(B82=0,\"\",IF(M$1=0,0,Daten!B$11))","v":""},{"$f":"IF(B82=0,\"\",IF(N$1=0,0,Daten!B$12))","v":""},"",{"$f":"IF(B82=0,\"\",Daten!B$6)","v":""},{"$f":"IF(B82=0,\"\",Daten!B$16)","v":""},{"$f":"IF(B82=0,\"\",IF(Daten!B$1=TRUE,Daten!B$17,\"-\"))","v":""},{"$f":"IF(B82=0,\"\",IF(C82=\"Nein\",\"-\",Daten!D$7))","v":""},{"$f":"IF(B82=\"\",\"\",IF(C82=\"Nein\",\"-\",IF(T$1=0,\"\",Daten!D$12)))","v":""},{"$f":"IF(B82=\"\",\"\",IF(C82=\"Nein\",\"-\",IF(T$1=0,\"\",Daten!D$13)))","v":""},{"$f":"IF(B82=\"\",\"\",IF(C82=\"Nein\",\"-\",IF(T$1=0,\"\",IF(AK82=\"\",\"\",AK82+X82-Daten!D$20))))","v":""},{"$f":"IF(B82=0,\"\",IF(L$1=1,M82+N82,Daten!D$2))","v":""},{"$f":"IF(B82=0,\"\",IF(C82=\"Nein\",\"-\",Daten!D$6))","v":""},{"$f":"IF(B82=0,\"\",IF(C82=\"Nein\",\"-\",Daten!D$3))","v":""},{"$f":"IF(B82=0,\"\",Daten!D$4)","v":""},{"$f":"IF(B82=0,\"\",IF(C82=\"Nein\",\"-\",Daten!D$5))","v":""},{"$f":"IF(B82=0,\"\",IF(Daten!F$1=\"Keine\",Daten!A$45,IF(Daten!F$7=TRUE,Daten!A$48,Daten!A$44)))","v":""},{"$f":"IF(B82=0,\"\",IF(AB82=\"Standard\",IF(Daten!F$9=TRUE,1,0),0))","v":""},"",{"$f":"IF(B82=0,\"\",IF(OR(AB82=Daten!A$46,AB82=Daten!A$47,AB82=Daten!A$48),AI82+W82,\"-\"))","v":""},{"$f":"IF(B82=0,\"\",IF(AB82=Daten!A$45,\"-\",Daten!F$5))","v":""},{"$f":"IF(B82=0,\"\",IF(AB82=Daten!A$45,\"-\",Daten!F$4))","v":""},{"$f":"IF(B82=0,\"\",IF(AB82=Daten!A$45,\"-\",Daten!F$6))","v":""},{"$f":"IF(B82=0,\"\",IF(AB82=Daten!A$45,\"-\",Daten!F$2))","v":""},{"$f":"IF(B82=0,\"\",IF(AB82=Daten!A$45,\"-\",Daten!F$3))","v":""},"",{"$f":"IF(B82=0,\"\",IF(OR(C82=\"Nein\",Daten!D87=\"Ohne\"),\"-\",Daten!D$9))","v":""},{"$f":"IF(B82=0,\"\",IF(OR(C82=\"Nein\",Daten!D87=\"Ohne\"),\"-\",IF(Daten!D$8=\"Rahmendämmung\",Daten!D$10,\"-\")))","v":""},{"$f":"IF(B82=0,\"\",IF(AND(C82=\"Ja\",Daten!D$15=TRUE),Daten!D$16,\"-\"))","v":""},{"$f":"IF(AN82=\"\",\"\",IF(AND(C82=\"Ja\",Daten!D$15=TRUE),Daten!D$18,\"-\"))","v":""},{"$f":"IF(B82=0,\"\",IF(Daten!H$7=TRUE,\"bauseits\",IF(Daten!H$8=TRUE,\"FSP 40\",\"WSP 40\")))","v":""},{"$f":"IF(B82=0,\"\",Daten!H$10)","v":""},{"$f":"IFERROR(IF(B82=0,\"\",IF(Daten!H$2=TRUE,1,0)*IF(J82+P82+P82+Q82+Q82>Daten!B$62,0,1)*IF(K82+P82+Z82+AF82+10>Daten!B$62,0,1)),0)","v":""}]
[null,null,{"$f":"IF(A83=\"\",\"\",IF(Daten!D$1<>\"Keine\",\"Ja\",\"Nein\"))","v":""},{"$f":"IF(A83=\"\",\"\",IF(Daten!B$4=TRUE,\"QB\",\"BS\")&IF(AR83=1,\"G\",\"\")&IF(C83=\"Nein\",\"-V\",IF(Daten!D$11=TRUE,\"-S\",\"-H\"))&IF(Daten!B$1=TRUE,\"-E\",\"\")&IF(Daten!F$9=TRUE,\"-B\",\"\")&IF(Daten!F$8=TRUE,\"A\",\"\"))","v":""},{"$f":"IF(A83=\"\",\"\",IFERROR(VLOOKUP(D83,Daten!D$43:G$94,2,FALSE),\"spez.\"))","v":""},null,null,null,null,{"$f":"IF(F83<>\"\",F83+(2*(Daten!B$13+2)),IF(H83<>\"\",H83-10,\"\"))","v":""},{"$f":"IFERROR(IF(G83<>\"\",G83+Daten!B$14+Daten!B$15+2+IF(AG83=\"-\",0,AG83),IF(I83<>\"\",I83-5,\"\")),\"\")","v":""},{"$f":"IF(B83=0,\"\",IF(L$1=0,0,Daten!B$10))","v":""},{"$f":"IF(B83=0,\"\",IF(M$1=0,0,Daten!B$11))","v":""},{"$f":"IF(B83=0,\"\",IF(N$1=0,0,Daten!B$12))","v":""},"",{"$f":"IF(B83=0,\"\",Daten!B$6)","v":""},{"$f":"IF(B83=0,\"\",Daten!B$16)","v":""},{"$f":"IF(B83=0,\"\",IF(Daten!B$1=TRUE,Daten!B$17,\"-\"))","v":""},{"$f":"IF(B83=0,\"\",IF(C83=\"Nein\",\"-\",Daten!D$7))","v":""},{"$f":"IF(B83=\"\",\"\",IF(C83=\"Nein\",\"-\",IF(T$1=0,\"\",Daten!D$12)))","v":""},{"$f":"IF(B83=\"\",\"\",IF(C83=\"Nein\",\"-\",IF(T$1=0,\"\",Daten!D$13)))","v":""},{"$f":"IF(B83=\"\",\"\",IF(C83=\"Nein\",\"-\",IF(T$1=0,\"\",IF(AK83=\"\",\"\",AK83+X83-Daten!D$20))))","v":""},{"$f":"IF(B83=0,\"\",IF(L$1=1,M83+N83,Daten!D$2))","v":""},{"$f":"IF(B83=0,\"\",IF(C83=\"Nein\",\"-\",Daten!D$6))","v":""},{"$f":"IF(B83=0,\"\",IF(C83=\"Nein\",\"-\",Daten!D$3))","v":""},{"$f":"IF(B83=0,\"\",Daten!D$4)","v":""},{"$f":"IF(B83=0,\"\",IF(C83=\"Nein\",\"-\",Daten!D$5))","v":""},{"$f":"IF(B83=0,\"\",IF(Daten!F$1=\"Keine\",Daten!A$45,IF(Daten!F$7=TRUE,Daten!A$48,Daten!A$44)))","v":""},{"$f":"IF(B83=0,\"\",IF(AB83=\"Standard\",IF(Daten!F$9=TRUE,1,0),0))","v":""},"",{"$f":"IF(B83=0,\"\",IF(OR(AB83=Daten!A$46,AB83=Daten!A$47,AB83=Daten!A$48),AI83+W83,\"-\"))","v":""},{"$f":"IF(B83=0,\"\",IF(AB83=Daten!A$45,\"-\",Daten!F$5))","v":""},{"$f":"IF(B83=0,\"\",IF(AB83=Daten!A$45,\"-\",Daten!F$4))","v":""},{"$f":"IF(B83=0,\"\",IF(AB83=Daten!A$45,\"-\",Daten!F$6))","v":""},{"$f":"IF(B83=0,\"\",IF(AB83=Daten!A$45,\"-\",Daten!F$2))","v":""},{"$f":"IF(B83=0,\"\",IF(AB83=Daten!A$45,\"-\",Daten!F$3))","v":""},"",{"$f":"IF(B83=0,\"\",IF(OR(C83=\"Nein\",Daten!D88=\"Ohne\"),\"-\",Daten!D$9))","v":""},{"$f":"IF(B83=0,\"\",IF(OR(C83=\"Nein\",Daten!D88=\"Ohne\"),\"-\",IF(Daten!D$8=\"Rahmendämmung\",Daten!D$10,\"-\")))","v":""},{"$f":"IF(B83=0,\"\",IF(AND(C83=\"Ja\",Daten!D$15=TRUE),Daten!D$16,\"-\"))","v":""},{"$f":"IF(AN83=\"\",\"\",IF(AND(C83=\"Ja\",Daten!D$15=TRUE),Daten!D$18,\"-\"))","v":""},{"$f":"IF(B83=0,\"\",IF(Daten!H$7=TRUE,\"bauseits\",IF(Daten!H$8=TRUE,\"FSP 40\",\"WSP 40\")))","v":""},{"$f":"IF(B83=0,\"\",Daten!H$10)","v":""},{"$f":"IFERROR(IF(B83=0,\"\",IF(Daten!H$2=TRUE,1,0)*IF(J83+P83+P83+Q83+Q83>Daten!B$62,0,1)*IF(K83+P83+Z83+AF83+10>Daten!B$62,0,1)),0)","v":""}]
[null,null,{"$f":"IF(A84=\"\",\"\",IF(Daten!D$1<>\"Keine\",\"Ja\",\"Nein\"))","v":""},{"$f":"IF(A84=\"\",\"\",IF(Daten!B$4=TRUE,\"QB\",\"BS\")&IF(AR84=1,\"G\",\"\")&IF(C84=\"Nein\",\"-V\",IF(Daten!D$11=TRUE,\"-S\",\"-H\"))&IF(Daten!B$1=TRUE,\"-E\",\"\")&IF(Daten!F$9=TRUE,\"-B\",\"\")&IF(Daten!F$8=TRUE,\"A\",\"\"))","v":""},{"$f":"IF(A84=\"\",\"\",IFERROR(VLOOKUP(D84,Daten!D$43:G$94,2,FALSE),\"spez.\"))","v":""},null,null,null,null,{"$f":"IF(F84<>\"\",F84+(2*(Daten!B$13+2)),IF(H84<>\"\",H84-10,\"\"))","v":""},{"$f":"IFERROR(IF(G84<>\"\",G84+Daten!B$14+Daten!B$15+2+IF(AG84=\"-\",0,AG84),IF(I84<>\"\",I84-5,\"\")),\"\")","v":""},{"$f":"IF(B84=0,\"\",IF(L$1=0,0,Daten!B$10))","v":""},{"$f":"IF(B84=0,\"\",IF(M$1=0,0,Daten!B$11))","v":""},{"$f":"IF(B84=0,\"\",IF(N$1=0,0,Daten!B$12))","v":""},"",{"$f":"IF(B84=0,\"\",Daten!B$6)","v":""},{"$f":"IF(B84=0,\"\",Daten!B$16)","v":""},{"$f":"IF(B84=0,\"\",IF(Daten!B$1=TRUE,Daten!B$17,\"-\"))","v":""},{"$f":"IF(B84=0,\"\",IF(C84=\"Nein\",\"-\",Daten!D$7))","v":""},{"$f":"IF(B84=\"\",\"\",IF(C84=\"Nein\",\"-\",IF(T$1=0,\"\",Daten!D$12)))","v":""},{"$f":"IF(B84=\"\",\"\",IF(C84=\"Nein\",\"-\",IF(T$1=0,\"\",Daten!D$13)))","v":""},{"$f":"IF(B84=\"\",\"\",IF(C84=\"Nein\",\"-\",IF(T$1=0,\"\",IF(AK84=\"\",\"\",AK84+X84-Daten!D$20))))","v":""},{"$f":"IF(B84=0,\"\",IF(L$1=1,M84+N84,Daten!D$2))","v":""},{"$f":"IF(B84=0,\"\",IF(C84=\"Nein\",\"-\",Daten!D$6))","v":""},{"$f":"IF(B84=0,\"\",IF(C84=\"Nein\",\"-\",Daten!D$3))","v":""},{"$f":"IF(B84=0,\"\",Daten!D$4)","v":""},{"$f":"IF(B84=0,\"\",IF(C84=\"Nein\",\"-\",Daten!D$5))","v":""},{"$f":"IF(B84=0,\"\",IF(Daten!F$1=\"Keine\",Daten!A$45,IF(Daten!F$7=TRUE,Daten!A$48,Daten!A$44)))","v":""},{"$f":"IF(B84=0,\"\",IF(AB84=\"Standard\",IF(Daten!F$9=TRUE,1,0),0))","v":""},"",{"$f":"IF(B84=0,\"\",IF(OR(AB84=Daten!A$46,AB84=Daten!A$47,AB84=Daten!A$48),AI84+W84,\"-\"))","v":""},{"$f":"IF(B84=0,\"\",IF(AB84=Daten!A$45,\"-\",Daten!F$5))","v":""},{"$f":"IF(B84=0,\"\",IF(AB84=Daten!A$45,\"-\",Daten!F$4))","v":""},{"$f":"IF(B84=0,\"\",IF(AB84=Daten!A$45,\"-\",Daten!F$6))","v":""},{"$f":"IF(B84=0,\"\",IF(AB84=Daten!A$45,\"-\",Daten!F$2))","v":""},{"$f":"IF(B84=0,\"\",IF(AB84=Daten!A$45,\"-\",Daten!F$3))","v":""},"",{"$f":"IF(B84=0,\"\",IF(OR(C84=\"Nein\",Daten!D89=\"Ohne\"),\"-\",Daten!D$9))","v":""},{"$f":"IF(B84=0,\"\",IF(OR(C84=\"Nein\",Daten!D89=\"Ohne\"),\"-\",IF(Daten!D$8=\"Rahmendämmung\",Daten!D$10,\"-\")))","v":""},{"$f":"IF(B84=0,\"\",IF(AND(C84=\"Ja\",Daten!D$15=TRUE),Daten!D$16,\"-\"))","v":""},{"$f":"IF(AN84=\"\",\"\",IF(AND(C84=\"Ja\",Daten!D$15=TRUE),Daten!D$18,\"-\"))","v":""},{"$f":"IF(B84=0,\"\",IF(Daten!H$7=TRUE,\"bauseits\",IF(Daten!H$8=TRUE,\"FSP 40\",\"WSP 40\")))","v":""},{"$f":"IF(B84=0,\"\",Daten!H$10)","v":""},{"$f":"IFERROR(IF(B84=0,\"\",IF(Daten!H$2=TRUE,1,0)*IF(J84+P84+P84+Q84+Q84>Daten!B$62,0,1)*IF(K84+P84+Z84+AF84+10>Daten!B$62,0,1)),0)","v":""}]
[null,null,{"$f":"IF(A85=\"\",\"\",IF(Daten!D$1<>\"Keine\",\"Ja\",\"Nein\"))","v":""},{"$f":"IF(A85=\"\",\"\",IF(Daten!B$4=TRUE,\"QB\",\"BS\")&IF(AR85=1,\"G\",\"\")&IF(C85=\"Nein\",\"-V\",IF(Daten!D$11=TRUE,\"-S\",\"-H\"))&IF(Daten!B$1=TRUE,\"-E\",\"\")&IF(Daten!F$9=TRUE,\"-B\",\"\")&IF(Daten!F$8=TRUE,\"A\",\"\"))","v":""},{"$f":"IF(A85=\"\",\"\",IFERROR(VLOOKUP(D85,Daten!D$43:G$94,2,FALSE),\"spez.\"))","v":""},null,null,null,null,{"$f":"IF(F85<>\"\",F85+(2*(Daten!B$13+2)),IF(H85<>\"\",H85-10,\"\"))","v":""},{"$f":"IFERROR(IF(G85<>\"\",G85+Daten!B$14+Daten!B$15+2+IF(AG85=\"-\",0,AG85),IF(I85<>\"\",I85-5,\"\")),\"\")","v":""},{"$f":"IF(B85=0,\"\",IF(L$1=0,0,Daten!B$10))","v":""},{"$f":"IF(B85=0,\"\",IF(M$1=0,0,Daten!B$11))","v":""},{"$f":"IF(B85=0,\"\",IF(N$1=0,0,Daten!B$12))","v":""},"",{"$f":"IF(B85=0,\"\",Daten!B$6)","v":""},{"$f":"IF(B85=0,\"\",Daten!B$16)","v":""},{"$f":"IF(B85=0,\"\",IF(Daten!B$1=TRUE,Daten!B$17,\"-\"))","v":""},{"$f":"IF(B85=0,\"\",IF(C85=\"Nein\",\"-\",Daten!D$7))","v":""},{"$f":"IF(B85=\"\",\"\",IF(C85=\"Nein\",\"-\",IF(T$1=0,\"\",Daten!D$12)))","v":""},{"$f":"IF(B85=\"\",\"\",IF(C85=\"Nein\",\"-\",IF(T$1=0,\"\",Daten!D$13)))","v":""},{"$f":"IF(B85=\"\",\"\",IF(C85=\"Nein\",\"-\",IF(T$1=0,\"\",IF(AK85=\"\",\"\",AK85+X85-Daten!D$20))))","v":""},{"$f":"IF(B85=0,\"\",IF(L$1=1,M85+N85,Daten!D$2))","v":""},{"$f":"IF(B85=0,\"\",IF(C85=\"Nein\",\"-\",Daten!D$6))","v":""},{"$f":"IF(B85=0,\"\",IF(C85=\"Nein\",\"-\",Daten!D$3))","v":""},{"$f":"IF(B85=0,\"\",Daten!D$4)","v":""},{"$f":"IF(B85=0,\"\",IF(C85=\"Nein\",\"-\",Daten!D$5))","v":""},{"$f":"IF(B85=0,\"\",IF(Daten!F$1=\"Keine\",Daten!A$45,IF(Daten!F$7=TRUE,Daten!A$48,Daten!A$44)))","v":""},{"$f":"IF(B85=0,\"\",IF(AB85=\"Standard\",IF(Daten!F$9=TRUE,1,0),0))","v":""},"",{"$f":"IF(B85=0,\"\",IF(OR(AB85=Daten!A$46,AB85=Daten!A$47,AB85=Daten!A$48),AI85+W85,\"-\"))","v":""},{"$f":"IF(B85=0,\"\",IF(AB85=Daten!A$45,\"-\",Daten!F$5))","v":""},{"$f":"IF(B85=0,\"\",IF(AB85=Daten!A$45,\"-\",Daten!F$4))","v":""},{"$f":"IF(B85=0,\"\",IF(AB85=Daten!A$45,\"-\",Daten!F$6))","v":""},{"$f":"IF(B85=0,\"\",IF(AB85=Daten!A$45,\"-\",Daten!F$2))","v":""},{"$f":"IF(B85=0,\"\",IF(AB85=Daten!A$45,\"-\",Daten!F$3))","v":""},"",{"$f":"IF(B85=0,\"\",IF(OR(C85=\"Nein\",Daten!D90=\"Ohne\"),\"-\",Daten!D$9))","v":""},{"$f":"IF(B85=0,\"\",IF(OR(C85=\"Nein\",Daten!D90=\"Ohne\"),\"-\",IF(Daten!D$8=\"Rahmendämmung\",Daten!D$10,\"-\")))","v":""},{"$f":"IF(B85=0,\"\",IF(AND(C85=\"Ja\",Daten!D$15=TRUE),Daten!D$16,\"-\"))","v":""},{"$f":"IF(AN85=\"\",\"\",IF(AND(C85=\"Ja\",Daten!D$15=TRUE),Daten!D$18,\"-\"))","v":""},{"$f":"IF(B85=0,\"\",IF(Daten!H$7=TRUE,\"bauseits\",IF(Daten!H$8=TRUE,\"FSP 40\",\"WSP 40\")))","v":""},{"$f":"IF(B85=0,\"\",Daten!H$10)","v":""},{"$f":"IFERROR(IF(B85=0,\"\",IF(Daten!H$2=TRUE,1,0)*IF(J85+P85+P85+Q85+Q85>Daten!B$62,0,1)*IF(K85+P85+Z85+AF85+10>Daten!B$62,0,1)),0)","v":""}]
[null,null,{"$f":"IF(A86=\"\",\"\",IF(Daten!D$1<>\"Keine\",\"Ja\",\"Nein\"))","v":""},{"$f":"IF(A86=\"\",\"\",IF(Daten!B$4=TRUE,\"QB\",\"BS\")&IF(AR86=1,\"G\",\"\")&IF(C86=\"Nein\",\"-V\",IF(Daten!D$11=TRUE,\"-S\",\"-H\"))&IF(Daten!B$1=TRUE,\"-E\",\"\")&IF(Daten!F$9=TRUE,\"-B\",\"\")&IF(Daten!F$8=TRUE,\"A\",\"\"))","v":""},{"$f":"IF(A86=\"\",\"\",IFERROR(VLOOKUP(D86,Daten!D$43:G$94,2,FALSE),\"spez.\"))","v":""},null,null,null,null,{"$f":"IF(F86<>\"\",F86+(2*(Daten!B$13+2)),IF(H86<>\"\",H86-10,\"\"))","v":""},{"$f":"IFERROR(IF(G86<>\"\",G86+Daten!B$14+Daten!B$15+2+IF(AG86=\"-\",0,AG86),IF(I86<>\"\",I86-5,\"\")),\"\")","v":""},{"$f":"IF(B86=0,\"\",IF(L$1=0,0,Daten!B$10))","v":""},{"$f":"IF(B86=0,\"\",IF(M$1=0,0,Daten!B$11))","v":""},{"$f":"IF(B86=0,\"\",IF(N$1=0,0,Daten!B$12))","v":""},"",{"$f":"IF(B86=0,\"\",Daten!B$6)","v":""},{"$f":"IF(B86=0,\"\",Daten!B$16)","v":""},{"$f":"IF(B86=0,\"\",IF(Daten!B$1=TRUE,Daten!B$17,\"-\"))","v":""},{"$f":"IF(B86=0,\"\",IF(C86=\"Nein\",\"-\",Daten!D$7))","v":""},{"$f":"IF(B86=\"\",\"\",IF(C86=\"Nein\",\"-\",IF(T$1=0,\"\",Daten!D$12)))","v":""},{"$f":"IF(B86=\"\",\"\",IF(C86=\"Nein\",\"-\",IF(T$1=0,\"\",Daten!D$13)))","v":""},{"$f":"IF(B86=\"\",\"\",IF(C86=\"Nein\",\"-\",IF(T$1=0,\"\",IF(AK86=\"\",\"\",AK86+X86-Daten!D$20))))","v":""},{"$f":"IF(B86=0,\"\",IF(L$1=1,M86+N86,Daten!D$2))","v":""},{"$f":"IF(B86=0,\"\",IF(C86=\"Nein\",\"-\",Daten!D$6))","v":""},{"$f":"IF(B86=0,\"\",IF(C86=\"Nein\",\"-\",Daten!D$3))","v":""},{"$f":"IF(B86=0,\"\",Daten!D$4)","v":""},{"$f":"IF(B86=0,\"\",IF(C86=\"Nein\",\"-\",Daten!D$5))","v":""},{"$f":"IF(B86=0,\"\",IF(Daten!F$1=\"Keine\",Daten!A$45,IF(Daten!F$7=TRUE,Daten!A$48,Daten!A$44)))","v":""},{"$f":"IF(B86=0,\"\",IF(AB86=\"Standard\",IF(Daten!F$9=TRUE,1,0),0))","v":""},"",{"$f":"IF(B86=0,\"\",IF(OR(AB86=Daten!A$46,AB86=Daten!A$47,AB86=Daten!A$48),AI86+W86,\"-\"))","v":""},{"$f":"IF(B86=0,\"\",IF(AB86=Daten!A$45,\"-\",Daten!F$5))","v":""},{"$f":"IF(B86=0,\"\",IF(AB86=Daten!A$45,\"-\",Daten!F$4))","v":""},{"$f":"IF(B86=0,\"\",IF(AB86=Daten!A$45,\"-\",Daten!F$6))","v":""},{"$f":"IF(B86=0,\"\",IF(AB86=Daten!A$45,\"-\",Daten!F$2))","v":""},{"$f":"IF(B86=0,\"\",IF(AB86=Daten!A$45,\"-\",Daten!F$3))","v":""},"",{"$f":"IF(B86=0,\"\",IF(OR(C86=\"Nein\",Daten!D91=\"Ohne\"),\"-\",Daten!D$9))","v":""},{"$f":"IF(B86=0,\"\",IF(OR(C86=\"Nein\",Daten!D91=\"Ohne\"),\"-\",IF(Daten!D$8=\"Rahmendämmung\",Daten!D$10,\"-\")))","v":""},{"$f":"IF(B86=0,\"\",IF(AND(C86=\"Ja\",Daten!D$15=TRUE),Daten!D$16,\"-\"))","v":""},{"$f":"IF(AN86=\"\",\"\",IF(AND(C86=\"Ja\",Daten!D$15=TRUE),Daten!D$18,\"-\"))","v":""},{"$f":"IF(B86=0,\"\",IF(Daten!H$7=TRUE,\"bauseits\",IF(Daten!H$8=TRUE,\"FSP 40\",\"WSP 40\")))","v":""},{"$f":"IF(B86=0,\"\",Daten!H$10)","v":""},{"$f":"IFERROR(IF(B86=0,\"\",IF(Daten!H$2=TRUE,1,0)*IF(J86+P86+P86+Q86+Q86>Daten!B$62,0,1)*IF(K86+P86+Z86+AF86+10>Daten!B$62,0,1)),0)","v":""}]
[null,null,{"$f":"IF(A87=\"\",\"\",IF(Daten!D$1<>\"Keine\",\"Ja\",\"Nein\"))","v":""},{"$f":"IF(A87=\"\",\"\",IF(Daten!B$4=TRUE,\"QB\",\"BS\")&IF(AR87=1,\"G\",\"\")&IF(C87=\"Nein\",\"-V\",IF(Daten!D$11=TRUE,\"-S\",\"-H\"))&IF(Daten!B$1=TRUE,\"-E\",\"\")&IF(Daten!F$9=TRUE,\"-B\",\"\")&IF(Daten!F$8=TRUE,\"A\",\"\"))","v":""},{"$f":"IF(A87=\"\",\"\",IFERROR(VLOOKUP(D87,Daten!D$43:G$94,2,FALSE),\"spez.\"))","v":""},null,null,null,null,{"$f":"IF(F87<>\"\",F87+(2*(Daten!B$13+2)),IF(H87<>\"\",H87-10,\"\"))","v":""},{"$f":"IFERROR(IF(G87<>\"\",G87+Daten!B$14+Daten!B$15+2+IF(AG87=\"-\",0,AG87),IF(I87<>\"\",I87-5,\"\")),\"\")","v":""},{"$f":"IF(B87=0,\"\",IF(L$1=0,0,Daten!B$10))","v":""},{"$f":"IF(B87=0,\"\",IF(M$1=0,0,Daten!B$11))","v":""},{"$f":"IF(B87=0,\"\",IF(N$1=0,0,Daten!B$12))","v":""},"",{"$f":"IF(B87=0,\"\",Daten!B$6)","v":""},{"$f":"IF(B87=0,\"\",Daten!B$16)","v":""},{"$f":"IF(B87=0,\"\",IF(Daten!B$1=TRUE,Daten!B$17,\"-\"))","v":""},{"$f":"IF(B87=0,\"\",IF(C87=\"Nein\",\"-\",Daten!D$7))","v":""},{"$f":"IF(B87=\"\",\"\",IF(C87=\"Nein\",\"-\",IF(T$1=0,\"\",Daten!D$12)))","v":""},{"$f":"IF(B87=\"\",\"\",IF(C87=\"Nein\",\"-\",IF(T$1=0,\"\",Daten!D$13)))","v":""},{"$f":"IF(B87=\"\",\"\",IF(C87=\"Nein\",\"-\",IF(T$1=0,\"\",IF(AK87=\"\",\"\",AK87+X87-Daten!D$20))))","v":""},{"$f":"IF(B87=0,\"\",IF(L$1=1,M87+N87,Daten!D$2))","v":""},{"$f":"IF(B87=0,\"\",IF(C87=\"Nein\",\"-\",Daten!D$6))","v":""},{"$f":"IF(B87=0,\"\",IF(C87=\"Nein\",\"-\",Daten!D$3))","v":""},{"$f":"IF(B87=0,\"\",Daten!D$4)","v":""},{"$f":"IF(B87=0,\"\",IF(C87=\"Nein\",\"-\",Daten!D$5))","v":""},{"$f":"IF(B87=0,\"\",IF(Daten!F$1=\"Keine\",Daten!A$45,IF(Daten!F$7=TRUE,Daten!A$48,Daten!A$44)))","v":""},{"$f":"IF(B87=0,\"\",IF(AB87=\"Standard\",IF(Daten!F$9=TRUE,1,0),0))","v":""},"",{"$f":"IF(B87=0,\"\",IF(OR(AB87=Daten!A$46,AB87=Daten!A$47,AB87=Daten!A$48),AI87+W87,\"-\"))","v":""},{"$f":"IF(B87=0,\"\",IF(AB87=Daten!A$45,\"-\",Daten!F$5))","v":""},{"$f":"IF(B87=0,\"\",IF(AB87=Daten!A$45,\"-\",Daten!F$4))","v":""},{"$f":"IF(B87=0,\"\",IF(AB87=Daten!A$45,\"-\",Daten!F$6))","v":""},{"$f":"IF(B87=0,\"\",IF(AB87=Daten!A$45,\"-\",Daten!F$2))","v":""},{"$f":"IF(B87=0,\"\",IF(AB87=Daten!A$45,\"-\",Daten!F$3))","v":""},"",{"$f":"IF(B87=0,\"\",IF(OR(C87=\"Nein\",Daten!D92=\"Ohne\"),\"-\",Daten!D$9))","v":""},{"$f":"IF(B87=0,\"\",IF(OR(C87=\"Nein\",Daten!D92=\"Ohne\"),\"-\",IF(Daten!D$8=\"Rahmendämmung\",Daten!D$10,\"-\")))","v":""},{"$f":"IF(B87=0,\"\",IF(AND(C87=\"Ja\",Daten!D$15=TRUE),Daten!D$16,\"-\"))","v":""},{"$f":"IF(AN87=\"\",\"\",IF(AND(C87=\"Ja\",Daten!D$15=TRUE),Daten!D$18,\"-\"))","v":""},{"$f":"IF(B87=0,\"\",IF(Daten!H$7=TRUE,\"bauseits\",IF(Daten!H$8=TRUE,\"FSP 40\",\"WSP 40\")))","v":""},{"$f":"IF(B87=0,\"\",Daten!H$10)","v":""},{"$f":"IFERROR(IF(B87=0,\"\",IF(Daten!H$2=TRUE,1,0)*IF(J87+P87+P87+Q87+Q87>Daten!B$62,0,1)*IF(K87+P87+Z87+AF87+10>Daten!B$62,0,1)),0)","v":""}]
[null,null,{"$f":"IF(A88=\"\",\"\",IF(Daten!D$1<>\"Keine\",\"Ja\",\"Nein\"))","v":""},{"$f":"IF(A88=\"\",\"\",IF(Daten!B$4=TRUE,\"QB\",\"BS\")&IF(AR88=1,\"G\",\"\")&IF(C88=\"Nein\",\"-V\",IF(Daten!D$11=TRUE,\"-S\",\"-H\"))&IF(Daten!B$1=TRUE,\"-E\",\"\")&IF(Daten!F$9=TRUE,\"-B\",\"\")&IF(Daten!F$8=TRUE,\"A\",\"\"))","v":""},{"$f":"IF(A88=\"\",\"\",IFERROR(VLOOKUP(D88,Daten!D$43:G$94,2,FALSE),\"spez.\"))","v":""},null,null,null,null,{"$f":"IF(F88<>\"\",F88+(2*(Daten!B$13+2)),IF(H88<>\"\",H88-10,\"\"))","v":""},{"$f":"IFERROR(IF(G88<>\"\",G88+Daten!B$14+Daten!B$15+2+IF(AG88=\"-\",0,AG88),IF(I88<>\"\",I88-5,\"\")),\"\")","v":""},{"$f":"IF(B88=0,\"\",IF(L$1=0,0,Daten!B$10))","v":""},{"$f":"IF(B88=0,\"\",IF(M$1=0,0,Daten!B$11))","v":""},{"$f":"IF(B88=0,\"\",IF(N$1=0,0,Daten!B$12))","v":""},"",{"$f":"IF(B88=0,\"\",Daten!B$6)","v":""},{"$f":"IF(B88=0,\"\",Daten!B$16)","v":""},{"$f":"IF(B88=0,\"\",IF(Daten!B$1=TRUE,Daten!B$17,\"-\"))","v":""},{"$f":"IF(B88=0,\"\",IF(C88=\"Nein\",\"-\",Daten!D$7))","v":""},{"$f":"IF(B88=\"\",\"\",IF(C88=\"Nein\",\"-\",IF(T$1=0,\"\",Daten!D$12)))","v":""},{"$f":"IF(B88=\"\",\"\",IF(C88=\"Nein\",\"-\",IF(T$1=0,\"\",Daten!D$13)))","v":""},{"$f":"IF(B88=\"\",\"\",IF(C88=\"Nein\",\"-\",IF(T$1=0,\"\",IF(AK88=\"\",\"\",AK88+X88-Daten!D$20))))","v":""},{"$f":"IF(B88=0,\"\",IF(L$1=1,M88+N88,Daten!D$2))","v":""},{"$f":"IF(B88=0,\"\",IF(C88=\"Nein\",\"-\",Daten!D$6))","v":""},{"$f":"IF(B88=0,\"\",IF(C88=\"Nein\",\"-\",Daten!D$3))","v":""},{"$f":"IF(B88=0,\"\",Daten!D$4)","v":""},{"$f":"IF(B88=0,\"\",IF(C88=\"Nein\",\"-\",Daten!D$5))","v":""},{"$f":"IF(B88=0,\"\",IF(Daten!F$1=\"Keine\",Daten!A$45,IF(Daten!F$7=TRUE,Daten!A$48,Daten!A$44)))","v":""},{"$f":"IF(B88=0,\"\",IF(AB88=\"Standard\",IF(Daten!F$9=TRUE,1,0),0))","v":""},"",{"$f":"IF(B88=0,\"\",IF(OR(AB88=Daten!A$46,AB88=Daten!A$47,AB88=Daten!A$48),AI88+W88,\"-\"))","v":""},{"$f":"IF(B88=0,\"\",IF(AB88=Daten!A$45,\"-\",Daten!F$5))","v":""},{"$f":"IF(B88=0,\"\",IF(AB88=Daten!A$45,\"-\",Daten!F$4))","v":""},{"$f":"IF(B88=0,\"\",IF(AB88=Daten!A$45,\"-\",Daten!F$6))","v":""},{"$f":"IF(B88=0,\"\",IF(AB88=Daten!A$45,\"-\",Daten!F$2))","v":""},{"$f":"IF(B88=0,\"\",IF(AB88=Daten!A$45,\"-\",Daten!F$3))","v":""},"",{"$f":"IF(B88=0,\"\",IF(OR(C88=\"Nein\",Daten!D93=\"Ohne\"),\"-\",Daten!D$9))","v":""},{"$f":"IF(B88=0,\"\",IF(OR(C88=\"Nein\",Daten!D93=\"Ohne\"),\"-\",IF(Daten!D$8=\"Rahmendämmung\",Daten!D$10,\"-\")))","v":""},{"$f":"IF(B88=0,\"\",IF(AND(C88=\"Ja\",Daten!D$15=TRUE),Daten!D$16,\"-\"))","v":""},{"$f":"IF(AN88=\"\",\"\",IF(AND(C88=\"Ja\",Daten!D$15=TRUE),Daten!D$18,\"-\"))","v":""},{"$f":"IF(B88=0,\"\",IF(Daten!H$7=TRUE,\"bauseits\",IF(Daten!H$8=TRUE,\"FSP 40\",\"WSP 40\")))","v":""},{"$f":"IF(B88=0,\"\",Daten!H$10)","v":""},{"$f":"IFERROR(IF(B88=0,\"\",IF(Daten!H$2=TRUE,1,0)*IF(J88+P88+P88+Q88+Q88>Daten!B$62,0,1)*IF(K88+P88+Z88+AF88+10>Daten!B$62,0,1)),0)","v":""}]
[null,null,{"$f":"IF(A89=\"\",\"\",IF(Daten!D$1<>\"Keine\",\"Ja\",\"Nein\"))","v":""},{"$f":"IF(A89=\"\",\"\",IF(Daten!B$4=TRUE,\"QB\",\"BS\")&IF(AR89=1,\"G\",\"\")&IF(C89=\"Nein\",\"-V\",IF(Daten!D$11=TRUE,\"-S\",\"-H\"))&IF(Daten!B$1=TRUE,\"-E\",\"\")&IF(Daten!F$9=TRUE,\"-B\",\"\")&IF(Daten!F$8=TRUE,\"A\",\"\"))","v":""},{"$f":"IF(A89=\"\",\"\",IFERROR(VLOOKUP(D89,Daten!D$43:G$94,2,FALSE),\"spez.\"))","v":""},null,null,null,null,{"$f":"IF(F89<>\"\",F89+(2*(Daten!B$13+2)),IF(H89<>\"\",H89-10,\"\"))","v":""},{"$f":"IFERROR(IF(G89<>\"\",G89+Daten!B$14+Daten!B$15+2+IF(AG89=\"-\",0,AG89),IF(I89<>\"\",I89-5,\"\")),\"\")","v":""},{"$f":"IF(B89=0,\"\",IF(L$1=0,0,Daten!B$10))","v":""},{"$f":"IF(B89=0,\"\",IF(M$1=0,0,Daten!B$11))","v":""},{"$f":"IF(B89=0,\"\",IF(N$1=0,0,Daten!B$12))","v":""},"",{"$f":"IF(B89=0,\"\",Daten!B$6)","v":""},{"$f":"IF(B89=0,\"\",Daten!B$16)","v":""},{"$f":"IF(B89=0,\"\",IF(Daten!B$1=TRUE,Daten!B$17,\"-\"))","v":""},{"$f":"IF(B89=0,\"\",IF(C89=\"Nein\",\"-\",Daten!D$7))","v":""},{"$f":"IF(B89=\"\",\"\",IF(C89=\"Nein\",\"-\",IF(T$1=0,\"\",Daten!D$12)))","v":""},{"$f":"IF(B89=\"\",\"\",IF(C89=\"Nein\",\"-\",IF(T$1=0,\"\",Daten!D$13)))","v":""},{"$f":"IF(B89=\"\",\"\",IF(C89=\"Nein\",\"-\",IF(T$1=0,\"\",IF(AK89=\"\",\"\",AK89+X89-Daten!D$20))))","v":""},{"$f":"IF(B89=0,\"\",IF(L$1=1,M89+N89,Daten!D$2))","v":""},{"$f":"IF(B89=0,\"\",IF(C89=\"Nein\",\"-\",Daten!D$6))","v":""},{"$f":"IF(B89=0,\"\",IF(C89=\"Nein\",\"-\",Daten!D$3))","v":""},{"$f":"IF(B89=0,\"\",Daten!D$4)","v":""},{"$f":"IF(B89=0,\"\",IF(C89=\"Nein\",\"-\",Daten!D$5))","v":""},{"$f":"IF(B89=0,\"\",IF(Daten!F$1=\"Keine\",Daten!A$45,IF(Daten!F$7=TRUE,Daten!A$48,Daten!A$44)))","v":""},{"$f":"IF(B89=0,\"\",IF(AB89=\"Standard\",IF(Daten!F$9=TRUE,1,0),0))","v":""},"",{"$f":"IF(B89=0,\"\",IF(OR(AB89=Daten!A$46,AB89=Daten!A$47,AB89=Daten!A$48),AI89+W89,\"-\"))","v":""},{"$f":"IF(B89=0,\"\",IF(AB89=Daten!A$45,\"-\",Daten!F$5))","v":""},{"$f":"IF(B89=0,\"\",IF(AB89=Daten!A$45,\"-\",Daten!F$4))","v":""},{"$f":"IF(B89=0,\"\",IF(AB89=Daten!A$45,\"-\",Daten!F$6))","v":""},{"$f":"IF(B89=0,\"\",IF(AB89=Daten!A$45,\"-\",Daten!F$2))","v":""},{"$f":"IF(B89=0,\"\",IF(AB89=Daten!A$45,\"-\",Daten!F$3))","v":""},"",{"$f":"IF(B89=0,\"\",IF(OR(C89=\"Nein\",Daten!D94=\"Ohne\"),\"-\",Daten!D$9))","v":""},{"$f":"IF(B89=0,\"\",IF(OR(C89=\"Nein\",Daten!D94=\"Ohne\"),\"-\",IF(Daten!D$8=\"Rahmendämmung\",Daten!D$10,\"-\")))","v":""},{"$f":"IF(B89=0,\"\",IF(AND(C89=\"Ja\",Daten!D$15=TRUE),Daten!D$16,\"-\"))","v":""},{"$f":"IF(AN89=\"\",\"\",IF(AND(C89=\"Ja\",Daten!D$15=TRUE),Daten!D$18,\"-\"))","v":""},{"$f":"IF(B89=0,\"\",IF(Daten!H$7=TRUE,\"bauseits\",IF(Daten!H$8=TRUE,\"FSP 40\",\"WSP 40\")))","v":""},{"$f":"IF(B89=0,\"\",Daten!H$10)","v":""},{"$f":"IFERROR(IF(B89=0,\"\",IF(Daten!H$2=TRUE,1,0)*IF(J89+P89+P89+Q89+Q89>Daten!B$62,0,1)*IF(K89+P89+Z89+AF89+10>Daten!B$62,0,1)),0)","v":""}]
[null,null,{"$f":"IF(A90=\"\",\"\",IF(Daten!D$1<>\"Keine\",\"Ja\",\"Nein\"))","v":""},{"$f":"IF(A90=\"\",\"\",IF(Daten!B$4=TRUE,\"QB\",\"BS\")&IF(AR90=1,\"G\",\"\")&IF(C90=\"Nein\",\"-V\",IF(Daten!D$11=TRUE,\"-S\",\"-H\"))&IF(Daten!B$1=TRUE,\"-E\",\"\")&IF(Daten!F$9=TRUE,\"-B\",\"\")&IF(Daten!F$8=TRUE,\"A\",\"\"))","v":""},{"$f":"IF(A90=\"\",\"\",IFERROR(VLOOKUP(D90,Daten!D$43:G$94,2,FALSE),\"spez.\"))","v":""},null,null,null,null,{"$f":"IF(F90<>\"\",F90+(2*(Daten!B$13+2)),IF(H90<>\"\",H90-10,\"\"))","v":""},{"$f":"IFERROR(IF(G90<>\"\",G90+Daten!B$14+Daten!B$15+2+IF(AG90=\"-\",0,AG90),IF(I90<>\"\",I90-5,\"\")),\"\")","v":""},{"$f":"IF(B90=0,\"\",IF(L$1=0,0,Daten!B$10))","v":""},{"$f":"IF(B90=0,\"\",IF(M$1=0,0,Daten!B$11))","v":""},{"$f":"IF(B90=0,\"\",IF(N$1=0,0,Daten!B$12))","v":""},"",{"$f":"IF(B90=0,\"\",Daten!B$6)","v":""},{"$f":"IF(B90=0,\"\",Daten!B$16)","v":""},{"$f":"IF(B90=0,\"\",IF(Daten!B$1=TRUE,Daten!B$17,\"-\"))","v":""},{"$f":"IF(B90=0,\"\",IF(C90=\"Nein\",\"-\",Daten!D$7))","v":""},{"$f":"IF(B90=\"\",\"\",IF(C90=\"Nein\",\"-\",IF(T$1=0,\"\",Daten!D$12)))","v":""},{"$f":"IF(B90=\"\",\"\",IF(C90=\"Nein\",\"-\",IF(T$1=0,\"\",Daten!D$13)))","v":""},{"$f":"IF(B90=\"\",\"\",IF(C90=\"Nein\",\"-\",IF(T$1=0,\"\",IF(AK90=\"\",\"\",AK90+X90-Daten!D$20))))","v":""},{"$f":"IF(B90=0,\"\",IF(L$1=1,M90+N90,Daten!D$2))","v":""},{"$f":"IF(B90=0,\"\",IF(C90=\"Nein\",\"-\",Daten!D$6))","v":""},{"$f":"IF(B90=0,\"\",IF(C90=\"Nein\",\"-\",Daten!D$3))","v":""},{"$f":"IF(B90=0,\"\",Daten!D$4)","v":""},{"$f":"IF(B90=0,\"\",IF(C90=\"Nein\",\"-\",Daten!D$5))","v":""},{"$f":"IF(B90=0,\"\",IF(Daten!F$1=\"Keine\",Daten!A$45,IF(Daten!F$7=TRUE,Daten!A$48,Daten!A$44)))","v":""},{"$f":"IF(B90=0,\"\",IF(AB90=\"Standard\",IF(Daten!F$9=TRUE,1,0),0))","v":""},"",{"$f":"IF(B90=0,\"\",IF(OR(AB90=Daten!A$46,AB90=Daten!A$47,AB90=Daten!A$48),AI90+W90,\"-\"))","v":""},{"$f":"IF(B90=0,\"\",IF(AB90=Daten!A$45,\"-\",Daten!F$5))","v":""},{"$f":"IF(B90=0,\"\",IF(AB90=Daten!A$45,\"-\",Daten!F$4))","v":""},{"$f":"IF(B90=0,\"\",IF(AB90=Daten!A$45,\"-\",Daten!F$6))","v":""},{"$f":"IF(B90=0,\"\",IF(AB90=Daten!A$45,\"-\",Daten!F$2))","v":""},{"$f":"IF(B90=0,\"\",IF(AB90=Daten!A$45,\"-\",Daten!F$3))","v":""},"",{"$f":"IF(B90=0,\"\",IF(OR(C90=\"Nein\",Daten!D95=\"Ohne\"),\"-\",Daten!D$9))","v":""},{"$f":"IF(B90=0,\"\",IF(OR(C90=\"Nein\",Daten!D95=\"Ohne\"),\"-\",IF(Daten!D$8=\"Rahmendämmung\",Daten!D$10,\"-\")))","v":""},{"$f":"IF(B90=0,\"\",IF(AND(C90=\"Ja\",Daten!D$15=TRUE),Daten!D$16,\"-\"))","v":""},{"$f":"IF(AN90=\"\",\"\",IF(AND(C90=\"Ja\",Daten!D$15=TRUE),Daten!D$18,\"-\"))","v":""},{"$f":"IF(B90=0,\"\",IF(Daten!H$7=TRUE,\"bauseits\",IF(Daten!H$8=TRUE,\"FSP 40\",\"WSP 40\")))","v":""},{"$f":"IF(B90=0,\"\",Daten!H$10)","v":""},{"$f":"IFERROR(IF(B90=0,\"\",IF(Daten!H$2=TRUE,1,0)*IF(J90+P90+P90+Q90+Q90>Daten!B$62,0,1)*IF(K90+P90+Z90+AF90+10>Daten!B$62,0,1)),0)","v":""}]
[null,null,{"$f":"IF(A91=\"\",\"\",IF(Daten!D$1<>\"Keine\",\"Ja\",\"Nein\"))","v":""},{"$f":"IF(A91=\"\",\"\",IF(Daten!B$4=TRUE,\"QB\",\"BS\")&IF(AR91=1,\"G\",\"\")&IF(C91=\"Nein\",\"-V\",IF(Daten!D$11=TRUE,\"-S\",\"-H\"))&IF(Daten!B$1=TRUE,\"-E\",\"\")&IF(Daten!F$9=TRUE,\"-B\",\"\")&IF(Daten!F$8=TRUE,\"A\",\"\"))","v":""},{"$f":"IF(A91=\"\",\"\",IFERROR(VLOOKUP(D91,Daten!D$43:G$94,2,FALSE),\"spez.\"))","v":""},null,null,null,null,{"$f":"IF(F91<>\"\",F91+(2*(Daten!B$13+2)),IF(H91<>\"\",H91-10,\"\"))","v":""},{"$f":"IFERROR(IF(G91<>\"\",G91+Daten!B$14+Daten!B$15+2+IF(AG91=\"-\",0,AG91),IF(I91<>\"\",I91-5,\"\")),\"\")","v":""},{"$f":"IF(B91=0,\"\",IF(L$1=0,0,Daten!B$10))","v":""},{"$f":"IF(B91=0,\"\",IF(M$1=0,0,Daten!B$11))","v":""},{"$f":"IF(B91=0,\"\",IF(N$1=0,0,Daten!B$12))","v":""},"",{"$f":"IF(B91=0,\"\",Daten!B$6)","v":""},{"$f":"IF(B91=0,\"\",Daten!B$16)","v":""},{"$f":"IF(B91=0,\"\",IF(Daten!B$1=TRUE,Daten!B$17,\"-\"))","v":""},{"$f":"IF(B91=0,\"\",IF(C91=\"Nein\",\"-\",Daten!D$7))","v":""},{"$f":"IF(B91=\"\",\"\",IF(C91=\"Nein\",\"-\",IF(T$1=0,\"\",Daten!D$12)))","v":""},{"$f":"IF(B91=\"\",\"\",IF(C91=\"Nein\",\"-\",IF(T$1=0,\"\",Daten!D$13)))","v":""},{"$f":"IF(B91=\"\",\"\",IF(C91=\"Nein\",\"-\",IF(T$1=0,\"\",IF(AK91=\"\",\"\",AK91+X91-Daten!D$20))))","v":""},{"$f":"IF(B91=0,\"\",IF(L$1=1,M91+N91,Daten!D$2))","v":""},{"$f":"IF(B91=0,\"\",IF(C91=\"Nein\",\"-\",Daten!D$6))","v":""},{"$f":"IF(B91=0,\"\",IF(C91=\"Nein\",\"-\",Daten!D$3))","v":""},{"$f":"IF(B91=0,\"\",Daten!D$4)","v":""},{"$f":"IF(B91=0,\"\",IF(C91=\"Nein\",\"-\",Daten!D$5))","v":""},{"$f":"IF(B91=0,\"\",IF(Daten!F$1=\"Keine\",Daten!A$45,IF(Daten!F$7=TRUE,Daten!A$48,Daten!A$44)))","v":""},{"$f":"IF(B91=0,\"\",IF(AB91=\"Standard\",IF(Daten!F$9=TRUE,1,0),0))","v":""},"",{"$f":"IF(B91=0,\"\",IF(OR(AB91=Daten!A$46,AB91=Daten!A$47,AB91=Daten!A$48),AI91+W91,\"-\"))","v":""},{"$f":"IF(B91=0,\"\",IF(AB91=Daten!A$45,\"-\",Daten!F$5))","v":""},{"$f":"IF(B91=0,\"\",IF(AB91=Daten!A$45,\"-\",Daten!F$4))","v":""},{"$f":"IF(B91=0,\"\",IF(AB91=Daten!A$45,\"-\",Daten!F$6))","v":""},{"$f":"IF(B91=0,\"\",IF(AB91=Daten!A$45,\"-\",Daten!F$2))","v":""},{"$f":"IF(B91=0,\"\",IF(AB91=Daten!A$45,\"-\",Daten!F$3))","v":""},"",{"$f":"IF(B91=0,\"\",IF(OR(C91=\"Nein\",Daten!D96=\"Ohne\"),\"-\",Daten!D$9))","v":""},{"$f":"IF(B91=0,\"\",IF(OR(C91=\"Nein\",Daten!D96=\"Ohne\"),\"-\",IF(Daten!D$8=\"Rahmendämmung\",Daten!D$10,\"-\")))","v":""},{"$f":"IF(B91=0,\"\",IF(AND(C91=\"Ja\",Daten!D$15=TRUE),Daten!D$16,\"-\"))","v":""},{"$f":"IF(AN91=\"\",\"\",IF(AND(C91=\"Ja\",Daten!D$15=TRUE),Daten!D$18,\"-\"))","v":""},{"$f":"IF(B91=0,\"\",IF(Daten!H$7=TRUE,\"bauseits\",IF(Daten!H$8=TRUE,\"FSP 40\",\"WSP 40\")))","v":""},{"$f":"IF(B91=0,\"\",Daten!H$10)","v":""},{"$f":"IFERROR(IF(B91=0,\"\",IF(Daten!H$2=TRUE,1,0)*IF(J91+P91+P91+Q91+Q91>Daten!B$62,0,1)*IF(K91+P91+Z91+AF91+10>Daten!B$62,0,1)),0)","v":""}]
[null,null,{"$f":"IF(A92=\"\",\"\",IF(Daten!D$1<>\"Keine\",\"Ja\",\"Nein\"))","v":""},{"$f":"IF(A92=\"\",\"\",IF(Daten!B$4=TRUE,\"QB\",\"BS\")&IF(AR92=1,\"G\",\"\")&IF(C92=\"Nein\",\"-V\",IF(Daten!D$11=TRUE,\"-S\",\"-H\"))&IF(Daten!B$1=TRUE,\"-E\",\"\")&IF(Daten!F$9=TRUE,\"-B\",\"\")&IF(Daten!F$8=TRUE,\"A\",\"\"))","v":""},{"$f":"IF(A92=\"\",\"\",IFERROR(VLOOKUP(D92,Daten!D$43:G$94,2,FALSE),\"spez.\"))","v":""},null,null,null,null,{"$f":"IF(F92<>\"\",F92+(2*(Daten!B$13+2)),IF(H92<>\"\",H92-10,\"\"))","v":""},{"$f":"IFERROR(IF(G92<>\"\",G92+Daten!B$14+Daten!B$15+2+IF(AG92=\"-\",0,AG92),IF(I92<>\"\",I92-5,\"\")),\"\")","v":""},{"$f":"IF(B92=0,\"\",IF(L$1=0,0,Daten!B$10))","v":""},{"$f":"IF(B92=0,\"\",IF(M$1=0,0,Daten!B$11))","v":""},{"$f":"IF(B92=0,\"\",IF(N$1=0,0,Daten!B$12))","v":""},"",{"$f":"IF(B92=0,\"\",Daten!B$6)","v":""},{"$f":"IF(B92=0,\"\",Daten!B$16)","v":""},{"$f":"IF(B92=0,\"\",IF(Daten!B$1=TRUE,Daten!B$17,\"-\"))","v":""},{"$f":"IF(B92=0,\"\",IF(C92=\"Nein\",\"-\",Daten!D$7))","v":""},{"$f":"IF(B92=\"\",\"\",IF(C92=\"Nein\",\"-\",IF(T$1=0,\"\",Daten!D$12)))","v":""},{"$f":"IF(B92=\"\",\"\",IF(C92=\"Nein\",\"-\",IF(T$1=0,\"\",Daten!D$13)))","v":""},{"$f":"IF(B92=\"\",\"\",IF(C92=\"Nein\",\"-\",IF(T$1=0,\"\",IF(AK92=\"\",\"\",AK92+X92-Daten!D$20))))","v":""},{"$f":"IF(B92=0,\"\",IF(L$1=1,M92+N92,Daten!D$2))","v":""},{"$f":"IF(B92=0,\"\",IF(C92=\"Nein\",\"-\",Daten!D$6))","v":""},{"$f":"IF(B92=0,\"\",IF(C92=\"Nein\",\"-\",Daten!D$3))","v":""},{"$f":"IF(B92=0,\"\",Daten!D$4)","v":""},{"$f":"IF(B92=0,\"\",IF(C92=\"Nein\",\"-\",Daten!D$5))","v":""},{"$f":"IF(B92=0,\"\",IF(Daten!F$1=\"Keine\",Daten!A$45,IF(Daten!F$7=TRUE,Daten!A$48,Daten!A$44)))","v":""},{"$f":"IF(B92=0,\"\",IF(AB92=\"Standard\",IF(Daten!F$9=TRUE,1,0),0))","v":""},"",{"$f":"IF(B92=0,\"\",IF(OR(AB92=Daten!A$46,AB92=Daten!A$47,AB92=Daten!A$48),AI92+W92,\"-\"))","v":""},{"$f":"IF(B92=0,\"\",IF(AB92=Daten!A$45,\"-\",Daten!F$5))","v":""},{"$f":"IF(B92=0,\"\",IF(AB92=Daten!A$45,\"-\",Daten!F$4))","v":""},{"$f":"IF(B92=0,\"\",IF(AB92=Daten!A$45,\"-\",Daten!F$6))","v":""},{"$f":"IF(B92=0,\"\",IF(AB92=Daten!A$45,\"-\",Daten!F$2))","v":""},{"$f":"IF(B92=0,\"\",IF(AB92=Daten!A$45,\"-\",Daten!F$3))","v":""},"",{"$f":"IF(B92=0,\"\",IF(OR(C92=\"Nein\",Daten!D97=\"Ohne\"),\"-\",Daten!D$9))","v":""},{"$f":"IF(B92=0,\"\",IF(OR(C92=\"Nein\",Daten!D97=\"Ohne\"),\"-\",IF(Daten!D$8=\"Rahmendämmung\",Daten!D$10,\"-\")))","v":""},{"$f":"IF(B92=0,\"\",IF(AND(C92=\"Ja\",Daten!D$15=TRUE),Daten!D$16,\"-\"))","v":""},{"$f":"IF(AN92=\"\",\"\",IF(AND(C92=\"Ja\",Daten!D$15=TRUE),Daten!D$18,\"-\"))","v":""},{"$f":"IF(B92=0,\"\",IF(Daten!H$7=TRUE,\"bauseits\",IF(Daten!H$8=TRUE,\"FSP 40\",\"WSP 40\")))","v":""},{"$f":"IF(B92=0,\"\",Daten!H$10)","v":""},{"$f":"IFERROR(IF(B92=0,\"\",IF(Daten!H$2=TRUE,1,0)*IF(J92+P92+P92+Q92+Q92>Daten!B$62,0,1)*IF(K92+P92+Z92+AF92+10>Daten!B$62,0,1)),0)","v":""}]
[null,null,{"$f":"IF(A93=\"\",\"\",IF(Daten!D$1<>\"Keine\",\"Ja\",\"Nein\"))","v":""},{"$f":"IF(A93=\"\",\"\",IF(Daten!B$4=TRUE,\"QB\",\"BS\")&IF(AR93=1,\"G\",\"\")&IF(C93=\"Nein\",\"-V\",IF(Daten!D$11=TRUE,\"-S\",\"-H\"))&IF(Daten!B$1=TRUE,\"-E\",\"\")&IF(Daten!F$9=TRUE,\"-B\",\"\")&IF(Daten!F$8=TRUE,\"A\",\"\"))","v":""},{"$f":"IF(A93=\"\",\"\",IFERROR(VLOOKUP(D93,Daten!D$43:G$94,2,FALSE),\"spez.\"))","v":""},null,null,null,null,{"$f":"IF(F93<>\"\",F93+(2*(Daten!B$13+2)),IF(H93<>\"\",H93-10,\"\"))","v":""},{"$f":"IFERROR(IF(G93<>\"\",G93+Daten!B$14+Daten!B$15+2+IF(AG93=\"-\",0,AG93),IF(I93<>\"\",I93-5,\"\")),\"\")","v":""},{"$f":"IF(B93=0,\"\",IF(L$1=0,0,Daten!B$10))","v":""},{"$f":"IF(B93=0,\"\",IF(M$1=0,0,Daten!B$11))","v":""},{"$f":"IF(B93=0,\"\",IF(N$1=0,0,Daten!B$12))","v":""},"",{"$f":"IF(B93=0,\"\",Daten!B$6)","v":""},{"$f":"IF(B93=0,\"\",Daten!B$16)","v":""},{"$f":"IF(B93=0,\"\",IF(Daten!B$1=TRUE,Daten!B$17,\"-\"))","v":""},{"$f":"IF(B93=0,\"\",IF(C93=\"Nein\",\"-\",Daten!D$7))","v":""},{"$f":"IF(B93=\"\",\"\",IF(C93=\"Nein\",\"-\",IF(T$1=0,\"\",Daten!D$12)))","v":""},{"$f":"IF(B93=\"\",\"\",IF(C93=\"Nein\",\"-\",IF(T$1=0,\"\",Daten!D$13)))","v":""},{"$f":"IF(B93=\"\",\"\",IF(C93=\"Nein\",\"-\",IF(T$1=0,\"\",IF(AK93=\"\",\"\",AK93+X93-Daten!D$20))))","v":""},{"$f":"IF(B93=0,\"\",IF(L$1=1,M93+N93,Daten!D$2))","v":""},{"$f":"IF(B93=0,\"\",IF(C93=\"Nein\",\"-\",Daten!D$6))","v":""},{"$f":"IF(B93=0,\"\",IF(C93=\"Nein\",\"-\",Daten!D$3))","v":""},{"$f":"IF(B93=0,\"\",Daten!D$4)","v":""},{"$f":"IF(B93=0,\"\",IF(C93=\"Nein\",\"-\",Daten!D$5))","v":""},{"$f":"IF(B93=0,\"\",IF(Daten!F$1=\"Keine\",Daten!A$45,IF(Daten!F$7=TRUE,Daten!A$48,Daten!A$44)))","v":""},{"$f":"IF(B93=0,\"\",IF(AB93=\"Standard\",IF(Daten!F$9=TRUE,1,0),0))","v":""},"",{"$f":"IF(B93=0,\"\",IF(OR(AB93=Daten!A$46,AB93=Daten!A$47,AB93=Daten!A$48),AI93+W93,\"-\"))","v":""},{"$f":"IF(B93=0,\"\",IF(AB93=Daten!A$45,\"-\",Daten!F$5))","v":""},{"$f":"IF(B93=0,\"\",IF(AB93=Daten!A$45,\"-\",Daten!F$4))","v":""},{"$f":"IF(B93=0,\"\",IF(AB93=Daten!A$45,\"-\",Daten!F$6))","v":""},{"$f":"IF(B93=0,\"\",IF(AB93=Daten!A$45,\"-\",Daten!F$2))","v":""},{"$f":"IF(B93=0,\"\",IF(AB93=Daten!A$45,\"-\",Daten!F$3))","v":""},"",{"$f":"IF(B93=0,\"\",IF(OR(C93=\"Nein\",Daten!D98=\"Ohne\"),\"-\",Daten!D$9))","v":""},{"$f":"IF(B93=0,\"\",IF(OR(C93=\"Nein\",Daten!D98=\"Ohne\"),\"-\",IF(Daten!D$8=\"Rahmendämmung\",Daten!D$10,\"-\")))","v":""},{"$f":"IF(B93=0,\"\",IF(AND(C93=\"Ja\",Daten!D$15=TRUE),Daten!D$16,\"-\"))","v":""},{"$f":"IF(AN93=\"\",\"\",IF(AND(C93=\"Ja\",Daten!D$15=TRUE),Daten!D$18,\"-\"))","v":""},{"$f":"IF(B93=0,\"\",IF(Daten!H$7=TRUE,\"bauseits\",IF(Daten!H$8=TRUE,\"FSP 40\",\"WSP 40\")))","v":""},{"$f":"IF(B93=0,\"\",Daten!H$10)","v":""},{"$f":"IFERROR(IF(B93=0,\"\",IF(Daten!H$2=TRUE,1,0)*IF(J93+P93+P93+Q93+Q93>Daten!B$62,0,1)*IF(K93+P93+Z93+AF93+10>Daten!B$62,0,1)),0)","v":""}]
[null,null,{"$f":"IF(A94=\"\",\"\",IF(Daten!D$1<>\"Keine\",\"Ja\",\"Nein\"))","v":""},{"$f":"IF(A94=\"\",\"\",IF(Daten!B$4=TRUE,\"QB\",\"BS\")&IF(AR94=1,\"G\",\"\")&IF(C94=\"Nein\",\"-V\",IF(Daten!D$11=TRUE,\"-S\",\"-H\"))&IF(Daten!B$1=TRUE,\"-E\",\"\")&IF(Daten!F$9=TRUE,\"-B\",\"\")&IF(Daten!F$8=TRUE,\"A\",\"\"))","v":""},{"$f":"IF(A94=\"\",\"\",IFERROR(VLOOKUP(D94,Daten!D$43:G$94,2,FALSE),\"spez.\"))","v":""},null,null,null,null,{"$f":"IF(F94<>\"\",F94+(2*(Daten!B$13+2)),IF(H94<>\"\",H94-10,\"\"))","v":""},{"$f":"IFERROR(IF(G94<>\"\",G94+Daten!B$14+Daten!B$15+2+IF(AG94=\"-\",0,AG94),IF(I94<>\"\",I94-5,\"\")),\"\")","v":""},{"$f":"IF(B94=0,\"\",IF(L$1=0,0,Daten!B$10))","v":""},{"$f":"IF(B94=0,\"\",IF(M$1=0,0,Daten!B$11))","v":""},{"$f":"IF(B94=0,\"\",IF(N$1=0,0,Daten!B$12))","v":""},"",{"$f":"IF(B94=0,\"\",Daten!B$6)","v":""},{"$f":"IF(B94=0,\"\",Daten!B$16)","v":""},{"$f":"IF(B94=0,\"\",IF(Daten!B$1=TRUE,Daten!B$17,\"-\"))","v":""},{"$f":"IF(B94=0,\"\",IF(C94=\"Nein\",\"-\",Daten!D$7))","v":""},{"$f":"IF(B94=\"\",\"\",IF(C94=\"Nein\",\"-\",IF(T$1=0,\"\",Daten!D$12)))","v":""},{"$f":"IF(B94=\"\",\"\",IF(C94=\"Nein\",\"-\",IF(T$1=0,\"\",Daten!D$13)))","v":""},{"$f":"IF(B94=\"\",\"\",IF(C94=\"Nein\",\"-\",IF(T$1=0,\"\",IF(AK94=\"\",\"\",AK94+X94-Daten!D$20))))","v":""},{"$f":"IF(B94=0,\"\",IF(L$1=1,M94+N94,Daten!D$2))","v":""},{"$f":"IF(B94=0,\"\",IF(C94=\"Nein\",\"-\",Daten!D$6))","v":""},{"$f":"IF(B94=0,\"\",IF(C94=\"Nein\",\"-\",Daten!D$3))","v":""},{"$f":"IF(B94=0,\"\",Daten!D$4)","v":""},{"$f":"IF(B94=0,\"\",IF(C94=\"Nein\",\"-\",Daten!D$5))","v":""},{"$f":"IF(B94=0,\"\",IF(Daten!F$1=\"Keine\",Daten!A$45,IF(Daten!F$7=TRUE,Daten!A$48,Daten!A$44)))","v":""},{"$f":"IF(B94=0,\"\",IF(AB94=\"Standard\",IF(Daten!F$9=TRUE,1,0),0))","v":""},"",{"$f":"IF(B94=0,\"\",IF(OR(AB94=Daten!A$46,AB94=Daten!A$47,AB94=Daten!A$48),AI94+W94,\"-\"))","v":""},{"$f":"IF(B94=0,\"\",IF(AB94=Daten!A$45,\"-\",Daten!F$5))","v":""},{"$f":"IF(B94=0,\"\",IF(AB94=Daten!A$45,\"-\",Daten!F$4))","v":""},{"$f":"IF(B94=0,\"\",IF(AB94=Daten!A$45,\"-\",Daten!F$6))","v":""},{"$f":"IF(B94=0,\"\",IF(AB94=Daten!A$45,\"-\",Daten!F$2))","v":""},{"$f":"IF(B94=0,\"\",IF(AB94=Daten!A$45,\"-\",Daten!F$3))","v":""},"",{"$f":"IF(B94=0,\"\",IF(OR(C94=\"Nein\",Daten!D99=\"Ohne\"),\"-\",Daten!D$9))","v":""},{"$f":"IF(B94=0,\"\",IF(OR(C94=\"Nein\",Daten!D99=\"Ohne\"),\"-\",IF(Daten!D$8=\"Rahmendämmung\",Daten!D$10,\"-\")))","v":""},{"$f":"IF(B94=0,\"\",IF(AND(C94=\"Ja\",Daten!D$15=TRUE),Daten!D$16,\"-\"))","v":""},{"$f":"IF(AN94=\"\",\"\",IF(AND(C94=\"Ja\",Daten!D$15=TRUE),Daten!D$18,\"-\"))","v":""},{"$f":"IF(B94=0,\"\",IF(Daten!H$7=TRUE,\"bauseits\",IF(Daten!H$8=TRUE,\"FSP 40\",\"WSP 40\")))","v":""},{"$f":"IF(B94=0,\"\",Daten!H$10)","v":""},{"$f":"IFERROR(IF(B94=0,\"\",IF(Daten!H$2=TRUE,1,0)*IF(J94+P94+P94+Q94+Q94>Daten!B$62,0,1)*IF(K94+P94+Z94+AF94+10>Daten!B$62,0,1)),0)","v":""}]
[null,null,{"$f":"IF(A95=\"\",\"\",IF(Daten!D$1<>\"Keine\",\"Ja\",\"Nein\"))","v":""},{"$f":"IF(A95=\"\",\"\",IF(Daten!B$4=TRUE,\"QB\",\"BS\")&IF(AR95=1,\"G\",\"\")&IF(C95=\"Nein\",\"-V\",IF(Daten!D$11=TRUE,\"-S\",\"-H\"))&IF(Daten!B$1=TRUE,\"-E\",\"\")&IF(Daten!F$9=TRUE,\"-B\",\"\")&IF(Daten!F$8=TRUE,\"A\",\"\"))","v":""},{"$f":"IF(A95=\"\",\"\",IFERROR(VLOOKUP(D95,Daten!D$43:G$94,2,FALSE),\"spez.\"))","v":""},null,null,null,null,{"$f":"IF(F95<>\"\",F95+(2*(Daten!B$13+2)),IF(H95<>\"\",H95-10,\"\"))","v":""},{"$f":"IFERROR(IF(G95<>\"\",G95+Daten!B$14+Daten!B$15+2+IF(AG95=\"-\",0,AG95),IF(I95<>\"\",I95-5,\"\")),\"\")","v":""},{"$f":"IF(B95=0,\"\",IF(L$1=0,0,Daten!B$10))","v":""},{"$f":"IF(B95=0,\"\",IF(M$1=0,0,Daten!B$11))","v":""},{"$f":"IF(B95=0,\"\",IF(N$1=0,0,Daten!B$12))","v":""},"",{"$f":"IF(B95=0,\"\",Daten!B$6)","v":""},{"$f":"IF(B95=0,\"\",Daten!B$16)","v":""},{"$f":"IF(B95=0,\"\",IF(Daten!B$1=TRUE,Daten!B$17,\"-\"))","v":""},{"$f":"IF(B95=0,\"\",IF(C95=\"Nein\",\"-\",Daten!D$7))","v":""},{"$f":"IF(B95=\"\",\"\",IF(C95=\"Nein\",\"-\",IF(T$1=0,\"\",Daten!D$12)))","v":""},{"$f":"IF(B95=\"\",\"\",IF(C95=\"Nein\",\"-\",IF(T$1=0,\"\",Daten!D$13)))","v":""},{"$f":"IF(B95=\"\",\"\",IF(C95=\"Nein\",\"-\",IF(T$1=0,\"\",IF(AK95=\"\",\"\",AK95+X95-Daten!D$20))))","v":""},{"$f":"IF(B95=0,\"\",IF(L$1=1,M95+N95,Daten!D$2))","v":""},{"$f":"IF(B95=0,\"\",IF(C95=\"Nein\",\"-\",Daten!D$6))","v":""},{"$f":"IF(B95=0,\"\",IF(C95=\"Nein\",\"-\",Daten!D$3))","v":""},{"$f":"IF(B95=0,\"\",Daten!D$4)","v":""},{"$f":"IF(B95=0,\"\",IF(C95=\"Nein\",\"-\",Daten!D$5))","v":""},{"$f":"IF(B95=0,\"\",IF(Daten!F$1=\"Keine\",Daten!A$45,IF(Daten!F$7=TRUE,Daten!A$48,Daten!A$44)))","v":""},{"$f":"IF(B95=0,\"\",IF(AB95=\"Standard\",IF(Daten!F$9=TRUE,1,0),0))","v":""},"",{"$f":"IF(B95=0,\"\",IF(OR(AB95=Daten!A$46,AB95=Daten!A$47,AB95=Daten!A$48),AI95+W95,\"-\"))","v":""},{"$f":"IF(B95=0,\"\",IF(AB95=Daten!A$45,\"-\",Daten!F$5))","v":""},{"$f":"IF(B95=0,\"\",IF(AB95=Daten!A$45,\"-\",Daten!F$4))","v":""},{"$f":"IF(B95=0,\"\",IF(AB95=Daten!A$45,\"-\",Daten!F$6))","v":""},{"$f":"IF(B95=0,\"\",IF(AB95=Daten!A$45,\"-\",Daten!F$2))","v":""},{"$f":"IF(B95=0,\"\",IF(AB95=Daten!A$45,\"-\",Daten!F$3))","v":""},"",{"$f":"IF(B95=0,\"\",IF(OR(C95=\"Nein\",Daten!D100=\"Ohne\"),\"-\",Daten!D$9))","v":""},{"$f":"IF(B95=0,\"\",IF(OR(C95=\"Nein\",Daten!D100=\"Ohne\"),\"-\",IF(Daten!D$8=\"Rahmendämmung\",Daten!D$10,\"-\")))","v":""},{"$f":"IF(B95=0,\"\",IF(AND(C95=\"Ja\",Daten!D$15=TRUE),Daten!D$16,\"-\"))","v":""},{"$f":"IF(AN95=\"\",\"\",IF(AND(C95=\"Ja\",Daten!D$15=TRUE),Daten!D$18,\"-\"))","v":""},{"$f":"IF(B95=0,\"\",IF(Daten!H$7=TRUE,\"bauseits\",IF(Daten!H$8=TRUE,\"FSP 40\",\"WSP 40\")))","v":""},{"$f":"IF(B95=0,\"\",Daten!H$10)","v":""},{"$f":"IFERROR(IF(B95=0,\"\",IF(Daten!H$2=TRUE,1,0)*IF(J95+P95+P95+Q95+Q95>Daten!B$62,0,1)*IF(K95+P95+Z95+AF95+10>Daten!B$62,0,1)),0)","v":""}]
[null,null,{"$f":"IF(A96=\"\",\"\",IF(Daten!D$1<>\"Keine\",\"Ja\",\"Nein\"))","v":""},{"$f":"IF(A96=\"\",\"\",IF(Daten!B$4=TRUE,\"QB\",\"BS\")&IF(AR96=1,\"G\",\"\")&IF(C96=\"Nein\",\"-V\",IF(Daten!D$11=TRUE,\"-S\",\"-H\"))&IF(Daten!B$1=TRUE,\"-E\",\"\")&IF(Daten!F$9=TRUE,\"-B\",\"\")&IF(Daten!F$8=TRUE,\"A\",\"\"))","v":""},{"$f":"IF(A96=\"\",\"\",IFERROR(VLOOKUP(D96,Daten!D$43:G$94,2,FALSE),\"spez.\"))","v":""},null,null,null,null,{"$f":"IF(F96<>\"\",F96+(2*(Daten!B$13+2)),IF(H96<>\"\",H96-10,\"\"))","v":""},{"$f":"IFERROR(IF(G96<>\"\",G96+Daten!B$14+Daten!B$15+2+IF(AG96=\"-\",0,AG96),IF(I96<>\"\",I96-5,\"\")),\"\")","v":""},{"$f":"IF(B96=0,\"\",IF(L$1=0,0,Daten!B$10))","v":""},{"$f":"IF(B96=0,\"\",IF(M$1=0,0,Daten!B$11))","v":""},{"$f":"IF(B96=0,\"\",IF(N$1=0,0,Daten!B$12))","v":""},"",{"$f":"IF(B96=0,\"\",Daten!B$6)","v":""},{"$f":"IF(B96=0,\"\",Daten!B$16)","v":""},{"$f":"IF(B96=0,\"\",IF(Daten!B$1=TRUE,Daten!B$17,\"-\"))","v":""},{"$f":"IF(B96=0,\"\",IF(C96=\"Nein\",\"-\",Daten!D$7))","v":""},{"$f":"IF(B96=\"\",\"\",IF(C96=\"Nein\",\"-\",IF(T$1=0,\"\",Daten!D$12)))","v":""},{"$f":"IF(B96=\"\",\"\",IF(C96=\"Nein\",\"-\",IF(T$1=0,\"\",Daten!D$13)))","v":""},{"$f":"IF(B96=\"\",\"\",IF(C96=\"Nein\",\"-\",IF(T$1=0,\"\",IF(AK96=\"\",\"\",AK96+X96-Daten!D$20))))","v":""},{"$f":"IF(B96=0,\"\",IF(L$1=1,M96+N96,Daten!D$2))","v":""},{"$f":"IF(B96=0,\"\",IF(C96=\"Nein\",\"-\",Daten!D$6))","v":""},{"$f":"IF(B96=0,\"\",IF(C96=\"Nein\",\"-\",Daten!D$3))","v":""},{"$f":"IF(B96=0,\"\",Daten!D$4)","v":""},{"$f":"IF(B96=0,\"\",IF(C96=\"Nein\",\"-\",Daten!D$5))","v":""},{"$f":"IF(B96=0,\"\",IF(Daten!F$1=\"Keine\",Daten!A$45,IF(Daten!F$7=TRUE,Daten!A$48,Daten!A$44)))","v":""},{"$f":"IF(B96=0,\"\",IF(AB96=\"Standard\",IF(Daten!F$9=TRUE,1,0),0))","v":""},"",{"$f":"IF(B96=0,\"\",IF(OR(AB96=Daten!A$46,AB96=Daten!A$47,AB96=Daten!A$48),AI96+W96,\"-\"))","v":""},{"$f":"IF(B96=0,\"\",IF(AB96=Daten!A$45,\"-\",Daten!F$5))","v":""},{"$f":"IF(B96=0,\"\",IF(AB96=Daten!A$45,\"-\",Daten!F$4))","v":""},{"$f":"IF(B96=0,\"\",IF(AB96=Daten!A$45,\"-\",Daten!F$6))","v":""},{"$f":"IF(B96=0,\"\",IF(AB96=Daten!A$45,\"-\",Daten!F$2))","v":""},{"$f":"IF(B96=0,\"\",IF(AB96=Daten!A$45,\"-\",Daten!F$3))","v":""},"",{"$f":"IF(B96=0,\"\",IF(OR(C96=\"Nein\",Daten!D101=\"Ohne\"),\"-\",Daten!D$9))","v":""},{"$f":"IF(B96=0,\"\",IF(OR(C96=\"Nein\",Daten!D101=\"Ohne\"),\"-\",IF(Daten!D$8=\"Rahmendämmung\",Daten!D$10,\"-\")))","v":""},{"$f":"IF(B96=0,\"\",IF(AND(C96=\"Ja\",Daten!D$15=TRUE),Daten!D$16,\"-\"))","v":""},{"$f":"IF(AN96=\"\",\"\",IF(AND(C96=\"Ja\",Daten!D$15=TRUE),Daten!D$18,\"-\"))","v":""},{"$f":"IF(B96=0,\"\",IF(Daten!H$7=TRUE,\"bauseits\",IF(Daten!H$8=TRUE,\"FSP 40\",\"WSP 40\")))","v":""},{"$f":"IF(B96=0,\"\",Daten!H$10)","v":""},{"$f":"IFERROR(IF(B96=0,\"\",IF(Daten!H$2=TRUE,1,0)*IF(J96+P96+P96+Q96+Q96>Daten!B$62,0,1)*IF(K96+P96+Z96+AF96+10>Daten!B$62,0,1)),0)","v":""}]
[null,null,{"$f":"IF(A97=\"\",\"\",IF(Daten!D$1<>\"Keine\",\"Ja\",\"Nein\"))","v":""},{"$f":"IF(A97=\"\",\"\",IF(Daten!B$4=TRUE,\"QB\",\"BS\")&IF(AR97=1,\"G\",\"\")&IF(C97=\"Nein\",\"-V\",IF(Daten!D$11=TRUE,\"-S\",\"-H\"))&IF(Daten!B$1=TRUE,\"-E\",\"\")&IF(Daten!F$9=TRUE,\"-B\",\"\")&IF(Daten!F$8=TRUE,\"A\",\"\"))","v":""},{"$f":"IF(A97=\"\",\"\",IFERROR(VLOOKUP(D97,Daten!D$43:G$94,2,FALSE),\"spez.\"))","v":""},null,null,null,null,{"$f":"IF(F97<>\"\",F97+(2*(Daten!B$13+2)),IF(H97<>\"\",H97-10,\"\"))","v":""},{"$f":"IFERROR(IF(G97<>\"\",G97+Daten!B$14+Daten!B$15+2+IF(AG97=\"-\",0,AG97),IF(I97<>\"\",I97-5,\"\")),\"\")","v":""},{"$f":"IF(B97=0,\"\",IF(L$1=0,0,Daten!B$10))","v":""},{"$f":"IF(B97=0,\"\",IF(M$1=0,0,Daten!B$11))","v":""},{"$f":"IF(B97=0,\"\",IF(N$1=0,0,Daten!B$12))","v":""},"",{"$f":"IF(B97=0,\"\",Daten!B$6)","v":""},{"$f":"IF(B97=0,\"\",Daten!B$16)","v":""},{"$f":"IF(B97=0,\"\",IF(Daten!B$1=TRUE,Daten!B$17,\"-\"))","v":""},{"$f":"IF(B97=0,\"\",IF(C97=\"Nein\",\"-\",Daten!D$7))","v":""},{"$f":"IF(B97=\"\",\"\",IF(C97=\"Nein\",\"-\",IF(T$1=0,\"\",Daten!D$12)))","v":""},{"$f":"IF(B97=\"\",\"\",IF(C97=\"Nein\",\"-\",IF(T$1=0,\"\",Daten!D$13)))","v":""},{"$f":"IF(B97=\"\",\"\",IF(C97=\"Nein\",\"-\",IF(T$1=0,\"\",IF(AK97=\"\",\"\",AK97+X97-Daten!D$20))))","v":""},{"$f":"IF(B97=0,\"\",IF(L$1=1,M97+N97,Daten!D$2))","v":""},{"$f":"IF(B97=0,\"\",IF(C97=\"Nein\",\"-\",Daten!D$6))","v":""},{"$f":"IF(B97=0,\"\",IF(C97=\"Nein\",\"-\",Daten!D$3))","v":""},{"$f":"IF(B97=0,\"\",Daten!D$4)","v":""},{"$f":"IF(B97=0,\"\",IF(C97=\"Nein\",\"-\",Daten!D$5))","v":""},{"$f":"IF(B97=0,\"\",IF(Daten!F$1=\"Keine\",Daten!A$45,IF(Daten!F$7=TRUE,Daten!A$48,Daten!A$44)))","v":""},{"$f":"IF(B97=0,\"\",IF(AB97=\"Standard\",IF(Daten!F$9=TRUE,1,0),0))","v":""},"",{"$f":"IF(B97=0,\"\",IF(OR(AB97=Daten!A$46,AB97=Daten!A$47,AB97=Daten!A$48),AI97+W97,\"-\"))","v":""},{"$f":"IF(B97=0,\"\",IF(AB97=Daten!A$45,\"-\",Daten!F$5))","v":""},{"$f":"IF(B97=0,\"\",IF(AB97=Daten!A$45,\"-\",Daten!F$4))","v":""},{"$f":"IF(B97=0,\"\",IF(AB97=Daten!A$45,\"-\",Daten!F$6))","v":""},{"$f":"IF(B97=0,\"\",IF(AB97=Daten!A$45,\"-\",Daten!F$2))","v":""},{"$f":"IF(B97=0,\"\",IF(AB97=Daten!A$45,\"-\",Daten!F$3))","v":""},"",{"$f":"IF(B97=0,\"\",IF(OR(C97=\"Nein\",Daten!D102=\"Ohne\"),\"-\",Daten!D$9))","v":""},{"$f":"IF(B97=0,\"\",IF(OR(C97=\"Nein\",Daten!D102=\"Ohne\"),\"-\",IF(Daten!D$8=\"Rahmendämmung\",Daten!D$10,\"-\")))","v":""},{"$f":"IF(B97=0,\"\",IF(AND(C97=\"Ja\",Daten!D$15=TRUE),Daten!D$16,\"-\"))","v":""},{"$f":"IF(AN97=\"\",\"\",IF(AND(C97=\"Ja\",Daten!D$15=TRUE),Daten!D$18,\"-\"))","v":""},{"$f":"IF(B97=0,\"\",IF(Daten!H$7=TRUE,\"bauseits\",IF(Daten!H$8=TRUE,\"FSP 40\",\"WSP 40\")))","v":""},{"$f":"IF(B97=0,\"\",Daten!H$10)","v":""},{"$f":"IFERROR(IF(B97=0,\"\",IF(Daten!H$2=TRUE,1,0)*IF(J97+P97+P97+Q97+Q97>Daten!B$62,0,1)*IF(K97+P97+Z97+AF97+10>Daten!B$62,0,1)),0)","v":""}]
[null,null,{"$f":"IF(A98=\"\",\"\",IF(Daten!D$1<>\"Keine\",\"Ja\",\"Nein\"))","v":""},{"$f":"IF(A98=\"\",\"\",IF(Daten!B$4=TRUE,\"QB\",\"BS\")&IF(AR98=1,\"G\",\"\")&IF(C98=\"Nein\",\"-V\",IF(Daten!D$11=TRUE,\"-S\",\"-H\"))&IF(Daten!B$1=TRUE,\"-E\",\"\")&IF(Daten!F$9=TRUE,\"-B\",\"\")&IF(Daten!F$8=TRUE,\"A\",\"\"))","v":""},{"$f":"IF(A98=\"\",\"\",IFERROR(VLOOKUP(D98,Daten!D$43:G$94,2,FALSE),\"spez.\"))","v":""},null,null,null,null,{"$f":"IF(F98<>\"\",F98+(2*(Daten!B$13+2)),IF(H98<>\"\",H98-10,\"\"))","v":""},{"$f":"IFERROR(IF(G98<>\"\",G98+Daten!B$14+Daten!B$15+2+IF(AG98=\"-\",0,AG98),IF(I98<>\"\",I98-5,\"\")),\"\")","v":""},{"$f":"IF(B98=0,\"\",IF(L$1=0,0,Daten!B$10))","v":""},{"$f":"IF(B98=0,\"\",IF(M$1=0,0,Daten!B$11))","v":""},{"$f":"IF(B98=0,\"\",IF(N$1=0,0,Daten!B$12))","v":""},"",{"$f":"IF(B98=0,\"\",Daten!B$6)","v":""},{"$f":"IF(B98=0,\"\",Daten!B$16)","v":""},{"$f":"IF(B98=0,\"\",IF(Daten!B$1=TRUE,Daten!B$17,\"-\"))","v":""},{"$f":"IF(B98=0,\"\",IF(C98=\"Nein\",\"-\",Daten!D$7))","v":""},{"$f":"IF(B98=\"\",\"\",IF(C98=\"Nein\",\"-\",IF(T$1=0,\"\",Daten!D$12)))","v":""},{"$f":"IF(B98=\"\",\"\",IF(C98=\"Nein\",\"-\",IF(T$1=0,\"\",Daten!D$13)))","v":""},{"$f":"IF(B98=\"\",\"\",IF(C98=\"Nein\",\"-\",IF(T$1=0,\"\",IF(AK98=\"\",\"\",AK98+X98-Daten!D$20))))","v":""},{"$f":"IF(B98=0,\"\",IF(L$1=1,M98+N98,Daten!D$2))","v":""},{"$f":"IF(B98=0,\"\",IF(C98=\"Nein\",\"-\",Daten!D$6))","v":""},{"$f":"IF(B98=0,\"\",IF(C98=\"Nein\",\"-\",Daten!D$3))","v":""},{"$f":"IF(B98=0,\"\",Daten!D$4)","v":""},{"$f":"IF(B98=0,\"\",IF(C98=\"Nein\",\"-\",Daten!D$5))","v":""},{"$f":"IF(B98=0,\"\",IF(Daten!F$1=\"Keine\",Daten!A$45,IF(Daten!F$7=TRUE,Daten!A$48,Daten!A$44)))","v":""},{"$f":"IF(B98=0,\"\",IF(AB98=\"Standard\",IF(Daten!F$9=TRUE,1,0),0))","v":""},"",{"$f":"IF(B98=0,\"\",IF(OR(AB98=Daten!A$46,AB98=Daten!A$47,AB98=Daten!A$48),AI98+W98,\"-\"))","v":""},{"$f":"IF(B98=0,\"\",IF(AB98=Daten!A$45,\"-\",Daten!F$5))","v":""},{"$f":"IF(B98=0,\"\",IF(AB98=Daten!A$45,\"-\",Daten!F$4))","v":""},{"$f":"IF(B98=0,\"\",IF(AB98=Daten!A$45,\"-\",Daten!F$6))","v":""},{"$f":"IF(B98=0,\"\",IF(AB98=Daten!A$45,\"-\",Daten!F$2))","v":""},{"$f":"IF(B98=0,\"\",IF(AB98=Daten!A$45,\"-\",Daten!F$3))","v":""},"",{"$f":"IF(B98=0,\"\",IF(OR(C98=\"Nein\",Daten!D103=\"Ohne\"),\"-\",Daten!D$9))","v":""},{"$f":"IF(B98=0,\"\",IF(OR(C98=\"Nein\",Daten!D103=\"Ohne\"),\"-\",IF(Daten!D$8=\"Rahmendämmung\",Daten!D$10,\"-\")))","v":""},{"$f":"IF(B98=0,\"\",IF(AND(C98=\"Ja\",Daten!D$15=TRUE),Daten!D$16,\"-\"))","v":""},{"$f":"IF(AN98=\"\",\"\",IF(AND(C98=\"Ja\",Daten!D$15=TRUE),Daten!D$18,\"-\"))","v":""},{"$f":"IF(B98=0,\"\",IF(Daten!H$7=TRUE,\"bauseits\",IF(Daten!H$8=TRUE,\"FSP 40\",\"WSP 40\")))","v":""},{"$f":"IF(B98=0,\"\",Daten!H$10)","v":""},{"$f":"IFERROR(IF(B98=0,\"\",IF(Daten!H$2=TRUE,1,0)*IF(J98+P98+P98+Q98+Q98>Daten!B$62,0,1)*IF(K98+P98+Z98+AF98+10>Daten!B$62,0,1)),0)","v":""}]
[null,null,{"$f":"IF(A99=\"\",\"\",IF(Daten!D$1<>\"Keine\",\"Ja\",\"Nein\"))","v":""},{"$f":"IF(A99=\"\",\"\",IF(Daten!B$4=TRUE,\"QB\",\"BS\")&IF(AR99=1,\"G\",\"\")&IF(C99=\"Nein\",\"-V\",IF(Daten!D$11=TRUE,\"-S\",\"-H\"))&IF(Daten!B$1=TRUE,\"-E\",\"\")&IF(Daten!F$9=TRUE,\"-B\",\"\")&IF(Daten!F$8=TRUE,\"A\",\"\"))","v":""},{"$f":"IF(A99=\"\",\"\",IFERROR(VLOOKUP(D99,Daten!D$43:G$94,2,FALSE),\"spez.\"))","v":""},null,null,null,null,{"$f":"IF(F99<>\"\",F99+(2*(Daten!B$13+2)),IF(H99<>\"\",H99-10,\"\"))","v":""},{"$f":"IFERROR(IF(G99<>\"\",G99+Daten!B$14+Daten!B$15+2+IF(AG99=\"-\",0,AG99),IF(I99<>\"\",I99-5,\"\")),\"\")","v":""},{"$f":"IF(B99=0,\"\",IF(L$1=0,0,Daten!B$10))","v":""},{"$f":"IF(B99=0,\"\",IF(M$1=0,0,Daten!B$11))","v":""},{"$f":"IF(B99=0,\"\",IF(N$1=0,0,Daten!B$12))","v":""},"",{"$f":"IF(B99=0,\"\",Daten!B$6)","v":""},{"$f":"IF(B99=0,\"\",Daten!B$16)","v":""},{"$f":"IF(B99=0,\"\",IF(Daten!B$1=TRUE,Daten!B$17,\"-\"))","v":""},{"$f":"IF(B99=0,\"\",IF(C99=\"Nein\",\"-\",Daten!D$7))","v":""},{"$f":"IF(B99=\"\",\"\",IF(C99=\"Nein\",\"-\",IF(T$1=0,\"\",Daten!D$12)))","v":""},{"$f":"IF(B99=\"\",\"\",IF(C99=\"Nein\",\"-\",IF(T$1=0,\"\",Daten!D$13)))","v":""},{"$f":"IF(B99=\"\",\"\",IF(C99=\"Nein\",\"-\",IF(T$1=0,\"\",IF(AK99=\"\",\"\",AK99+X99-Daten!D$20))))","v":""},{"$f":"IF(B99=0,\"\",IF(L$1=1,M99+N99,Daten!D$2))","v":""},{"$f":"IF(B99=0,\"\",IF(C99=\"Nein\",\"-\",Daten!D$6))","v":""},{"$f":"IF(B99=0,\"\",IF(C99=\"Nein\",\"-\",Daten!D$3))","v":""},{"$f":"IF(B99=0,\"\",Daten!D$4)","v":""},{"$f":"IF(B99=0,\"\",IF(C99=\"Nein\",\"-\",Daten!D$5))","v":""},{"$f":"IF(B99=0,\"\",IF(Daten!F$1=\"Keine\",Daten!A$45,IF(Daten!F$7=TRUE,Daten!A$48,Daten!A$44)))","v":""},{"$f":"IF(B99=0,\"\",IF(AB99=\"Standard\",IF(Daten!F$9=TRUE,1,0),0))","v":""},"",{"$f":"IF(B99=0,\"\",IF(OR(AB99=Daten!A$46,AB99=Daten!A$47,AB99=Daten!A$48),AI99+W99,\"-\"))","v":""},{"$f":"IF(B99=0,\"\",IF(AB99=Daten!A$45,\"-\",Daten!F$5))","v":""},{"$f":"IF(B99=0,\"\",IF(AB99=Daten!A$45,\"-\",Daten!F$4))","v":""},{"$f":"IF(B99=0,\"\",IF(AB99=Daten!A$45,\"-\",Daten!F$6))","v":""},{"$f":"IF(B99=0,\"\",IF(AB99=Daten!A$45,\"-\",Daten!F$2))","v":""},{"$f":"IF(B99=0,\"\",IF(AB99=Daten!A$45,\"-\",Daten!F$3))","v":""},"",{"$f":"IF(B99=0,\"\",IF(OR(C99=\"Nein\",Daten!D104=\"Ohne\"),\"-\",Daten!D$9))","v":""},{"$f":"IF(B99=0,\"\",IF(OR(C99=\"Nein\",Daten!D104=\"Ohne\"),\"-\",IF(Daten!D$8=\"Rahmendämmung\",Daten!D$10,\"-\")))","v":""},{"$f":"IF(B99=0,\"\",IF(AND(C99=\"Ja\",Daten!D$15=TRUE),Daten!D$16,\"-\"))","v":""},{"$f":"IF(AN99=\"\",\"\",IF(AND(C99=\"Ja\",Daten!D$15=TRUE),Daten!D$18,\"-\"))","v":""},{"$f":"IF(B99=0,\"\",IF(Daten!H$7=TRUE,\"bauseits\",IF(Daten!H$8=TRUE,\"FSP 40\",\"WSP 40\")))","v":""},{"$f":"IF(B99=0,\"\",Daten!H$10)","v":""},{"$f":"IFERROR(IF(B99=0,\"\",IF(Daten!H$2=TRUE,1,0)*IF(J99+P99+P99+Q99+Q99>Daten!B$62,0,1)*IF(K99+P99+Z99+AF99+10>Daten!B$62,0,1)),0)","v":""}]
[null,null,{"$f":"IF(A100=\"\",\"\",IF(Daten!D$1<>\"Keine\",\"Ja\",\"Nein\"))","v":""},{"$f":"IF(A100=\"\",\"\",IF(Daten!B$4=TRUE,\"QB\",\"BS\")&IF(AR100=1,\"G\",\"\")&IF(C100=\"Nein\",\"-V\",IF(Daten!D$11=TRUE,\"-S\",\"-H\"))&IF(Daten!B$1=TRUE,\"-E\",\"\")&IF(Daten!F$9=TRUE,\"-B\",\"\")&IF(Daten!F$8=TRUE,\"A\",\"\"))","v":""},{"$f":"IF(A100=\"\",\"\",IFERROR(VLOOKUP(D100,Daten!D$43:G$94,2,FALSE),\"spez.\"))","v":""},null,null,null,null,{"$f":"IF(F100<>\"\",F100+(2*(Daten!B$13+2)),IF(H100<>\"\",H100-10,\"\"))","v":""},{"$f":"IFERROR(IF(G100<>\"\",G100+Daten!B$14+Daten!B$15+2+IF(AG100=\"-\",0,AG100),IF(I100<>\"\",I100-5,\"\")),\"\")","v":""},{"$f":"IF(B100=0,\"\",IF(L$1=0,0,Daten!B$10))","v":""},{"$f":"IF(B100=0,\"\",IF(M$1=0,0,Daten!B$11))","v":""},{"$f":"IF(B100=0,\"\",IF(N$1=0,0,Daten!B$12))","v":""},"",{"$f":"IF(B100=0,\"\",Daten!B$6)","v":""},{"$f":"IF(B100=0,\"\",Daten!B$16)","v":""},{"$f":"IF(B100=0,\"\",IF(Daten!B$1=TRUE,Daten!B$17,\"-\"))","v":""},{"$f":"IF(B100=0,\"\",IF(C100=\"Nein\",\"-\",Daten!D$7))","v":""},{"$f":"IF(B100=\"\",\"\",IF(C100=\"Nein\",\"-\",IF(T$1=0,\"\",Daten!D$12)))","v":""},{"$f":"IF(B100=\"\",\"\",IF(C100=\"Nein\",\"-\",IF(T$1=0,\"\",Daten!D$13)))","v":""},{"$f":"IF(B100=\"\",\"\",IF(C100=\"Nein\",\"-\",IF(T$1=0,\"\",IF(AK100=\"\",\"\",AK100+X100-Daten!D$20))))","v":""},{"$f":"IF(B100=0,\"\",IF(L$1=1,M100+N100,Daten!D$2))","v":""},{"$f":"IF(B100=0,\"\",IF(C100=\"Nein\",\"-\",Daten!D$6))","v":""},{"$f":"IF(B100=0,\"\",IF(C100=\"Nein\",\"-\",Daten!D$3))","v":""},{"$f":"IF(B100=0,\"\",Daten!D$4)","v":""},{"$f":"IF(B100=0,\"\",IF(C100=\"Nein\",\"-\",Daten!D$5))","v":""},{"$f":"IF(B100=0,\"\",IF(Daten!F$1=\"Keine\",Daten!A$45,IF(Daten!F$7=TRUE,Daten!A$48,Daten!A$44)))","v":""},{"$f":"IF(B100=0,\"\",IF(AB100=\"Standard\",IF(Daten!F$9=TRUE,1,0),0))","v":""},"",{"$f":"IF(B100=0,\"\",IF(OR(AB100=Daten!A$46,AB100=Daten!A$47,AB100=Daten!A$48),AI100+W100,\"-\"))","v":""},{"$f":"IF(B100=0,\"\",IF(AB100=Daten!A$45,\"-\",Daten!F$5))","v":""},{"$f":"IF(B100=0,\"\",IF(AB100=Daten!A$45,\"-\",Daten!F$4))","v":""},{"$f":"IF(B100=0,\"\",IF(AB100=Daten!A$45,\"-\",Daten!F$6))","v":""},{"$f":"IF(B100=0,\"\",IF(AB100=Daten!A$45,\"-\",Daten!F$2))","v":""},{"$f":"IF(B100=0,\"\",IF(AB100=Daten!A$45,\"-\",Daten!F$3))","v":""},"",{"$f":"IF(B100=0,\"\",IF(OR(C100=\"Nein\",Daten!D105=\"Ohne\"),\"-\",Daten!D$9))","v":""},{"$f":"IF(B100=0,\"\",IF(OR(C100=\"Nein\",Daten!D105=\"Ohne\"),\"-\",IF(Daten!D$8=\"Rahmendämmung\",Daten!D$10,\"-\")))","v":""},{"$f":"IF(B100=0,\"\",IF(AND(C100=\"Ja\",Daten!D$15=TRUE),Daten!D$16,\"-\"))","v":""},{"$f":"IF(AN100=\"\",\"\",IF(AND(C100=\"Ja\",Daten!D$15=TRUE),Daten!D$18,\"-\"))","v":""},{"$f":"IF(B100=0,\"\",IF(Daten!H$7=TRUE,\"bauseits\",IF(Daten!H$8=TRUE,\"FSP 40\",\"WSP 40\")))","v":""},{"$f":"IF(B100=0,\"\",Daten!H$10)","v":""},{"$f":"IFERROR(IF(B100=0,\"\",IF(Daten!H$2=TRUE,1,0)*IF(J100+P100+P100+Q100+Q100>Daten!B$62,0,1)*IF(K100+P100+Z100+AF100+10>Daten!B$62,0,1)),0)","v":""}]
[null,null,{"$f":"IF(A101=\"\",\"\",IF(Daten!D$1<>\"Keine\",\"Ja\",\"Nein\"))","v":""},{"$f":"IF(A101=\"\",\"\",IF(Daten!B$4=TRUE,\"QB\",\"BS\")&IF(AR101=1,\"G\",\"\")&IF(C101=\"Nein\",\"-V\",IF(Daten!D$11=TRUE,\"-S\",\"-H\"))&IF(Daten!B$1=TRUE,\"-E\",\"\")&IF(Daten!F$9=TRUE,\"-B\",\"\")&IF(Daten!F$8=TRUE,\"A\",\"\"))","v":""},{"$f":"IF(A101=\"\",\"\",IFERROR(VLOOKUP(D101,Daten!D$43:G$94,2,FALSE),\"spez.\"))","v":""},null,null,null,null,{"$f":"IF(F101<>\"\",F101+(2*(Daten!B$13+2)),IF(H101<>\"\",H101-10,\"\"))","v":""},{"$f":"IFERROR(IF(G101<>\"\",G101+Daten!B$14+Daten!B$15+2+IF(AG101=\"-\",0,AG101),IF(I101<>\"\",I101-5,\"\")),\"\")","v":""},{"$f":"IF(B101=0,\"\",IF(L$1=0,0,Daten!B$10))","v":""},{"$f":"IF(B101=0,\"\",IF(M$1=0,0,Daten!B$11))","v":""},{"$f":"IF(B101=0,\"\",IF(N$1=0,0,Daten!B$12))","v":""},"",{"$f":"IF(B101=0,\"\",Daten!B$6)","v":""},{"$f":"IF(B101=0,\"\",Daten!B$16)","v":""},{"$f":"IF(B101=0,\"\",IF(Daten!B$1=TRUE,Daten!B$17,\"-\"))","v":""},{"$f":"IF(B101=0,\"\",IF(C101=\"Nein\",\"-\",Daten!D$7))","v":""},{"$f":"IF(B101=\"\",\"\",IF(C101=\"Nein\",\"-\",IF(T$1=0,\"\",Daten!D$12)))","v":""},{"$f":"IF(B101=\"\",\"\",IF(C101=\"Nein\",\"-\",IF(T$1=0,\"\",Daten!D$13)))","v":""},{"$f":"IF(B101=\"\",\"\",IF(C101=\"Nein\",\"-\",IF(T$1=0,\"\",IF(AK101=\"\",\"\",AK101+X101-Daten!D$20))))","v":""},{"$f":"IF(B101=0,\"\",IF(L$1=1,M101+N101,Daten!D$2))","v":""},{"$f":"IF(B101=0,\"\",IF(C101=\"Nein\",\"-\",Daten!D$6))","v":""},{"$f":"IF(B101=0,\"\",IF(C101=\"Nein\",\"-\",Daten!D$3))","v":""},{"$f":"IF(B101=0,\"\",Daten!D$4)","v":""},{"$f":"IF(B101=0,\"\",IF(C101=\"Nein\",\"-\",Daten!D$5))","v":""},{"$f":"IF(B101=0,\"\",IF(Daten!F$1=\"Keine\",Daten!A$45,IF(Daten!F$7=TRUE,Daten!A$48,Daten!A$44)))","v":""},{"$f":"IF(B101=0,\"\",IF(AB101=\"Standard\",IF(Daten!F$9=TRUE,1,0),0))","v":""},"",{"$f":"IF(B101=0,\"\",IF(OR(AB101=Daten!A$46,AB101=Daten!A$47,AB101=Daten!A$48),AI101+W101,\"-\"))","v":""},{"$f":"IF(B101=0,\"\",IF(AB101=Daten!A$45,\"-\",Daten!F$5))","v":""},{"$f":"IF(B101=0,\"\",IF(AB101=Daten!A$45,\"-\",Daten!F$4))","v":""},{"$f":"IF(B101=0,\"\",IF(AB101=Daten!A$45,\"-\",Daten!F$6))","v":""},{"$f":"IF(B101=0,\"\",IF(AB101=Daten!A$45,\"-\",Daten!F$2))","v":""},{"$f":"IF(B101=0,\"\",IF(AB101=Daten!A$45,\"-\",Daten!F$3))","v":""},"",{"$f":"IF(B101=0,\"\",IF(OR(C101=\"Nein\",Daten!D106=\"Ohne\"),\"-\",Daten!D$9))","v":""},{"$f":"IF(B101=0,\"\",IF(OR(C101=\"Nein\",Daten!D106=\"Ohne\"),\"-\",IF(Daten!D$8=\"Rahmendämmung\",Daten!D$10,\"-\")))","v":""},{"$f":"IF(B101=0,\"\",IF(AND(C101=\"Ja\",Daten!D$15=TRUE),Daten!D$16,\"-\"))","v":""},{"$f":"IF(AN101=\"\",\"\",IF(AND(C101=\"Ja\",Daten!D$15=TRUE),Daten!D$18,\"-\"))","v":""},{"$f":"IF(B101=0,\"\",IF(Daten!H$7=TRUE,\"bauseits\",IF(Daten!H$8=TRUE,\"FSP 40\",\"WSP 40\")))","v":""},{"$f":"IF(B101=0,\"\",Daten!H$10)","v":""},{"$f":"IFERROR(IF(B101=0,\"\",IF(Daten!H$2=TRUE,1,0)*IF(J101+P101+P101+Q101+Q101>Daten!B$62,0,1)*IF(K101+P101+Z101+AF101+10>Daten!B$62,0,1)),0)","v":""}]
[null,null,{"$f":"IF(A102=\"\",\"\",IF(Daten!D$1<>\"Keine\",\"Ja\",\"Nein\"))","v":""},{"$f":"IF(A102=\"\",\"\",IF(Daten!B$4=TRUE,\"QB\",\"BS\")&IF(AR102=1,\"G\",\"\")&IF(C102=\"Nein\",\"-V\",IF(Daten!D$11=TRUE,\"-S\",\"-H\"))&IF(Daten!B$1=TRUE,\"-E\",\"\")&IF(Daten!F$9=TRUE,\"-B\",\"\")&IF(Daten!F$8=TRUE,\"A\",\"\"))","v":""},{"$f":"IF(A102=\"\",\"\",IFERROR(VLOOKUP(D102,Daten!D$43:G$94,2,FALSE),\"spez.\"))","v":""},null,null,null,null,{"$f":"IF(F102<>\"\",F102+(2*(Daten!B$13+2)),IF(H102<>\"\",H102-10,\"\"))","v":""},{"$f":"IFERROR(IF(G102<>\"\",G102+Daten!B$14+Daten!B$15+2+IF(AG102=\"-\",0,AG102),IF(I102<>\"\",I102-5,\"\")),\"\")","v":""},{"$f":"IF(B102=0,\"\",IF(L$1=0,0,Daten!B$10))","v":""},{"$f":"IF(B102=0,\"\",IF(M$1=0,0,Daten!B$11))","v":""},{"$f":"IF(B102=0,\"\",IF(N$1=0,0,Daten!B$12))","v":""},"",{"$f":"IF(B102=0,\"\",Daten!B$6)","v":""},{"$f":"IF(B102=0,\"\",Daten!B$16)","v":""},{"$f":"IF(B102=0,\"\",IF(Daten!B$1=TRUE,Daten!B$17,\"-\"))","v":""},{"$f":"IF(B102=0,\"\",IF(C102=\"Nein\",\"-\",Daten!D$7))","v":""},{"$f":"IF(B102=\"\",\"\",IF(C102=\"Nein\",\"-\",IF(T$1=0,\"\",Daten!D$12)))","v":""},{"$f":"IF(B102=\"\",\"\",IF(C102=\"Nein\",\"-\",IF(T$1=0,\"\",Daten!D$13)))","v":""},{"$f":"IF(B102=\"\",\"\",IF(C102=\"Nein\",\"-\",IF(T$1=0,\"\",IF(AK102=\"\",\"\",AK102+X102-Daten!D$20))))","v":""},{"$f":"IF(B102=0,\"\",IF(L$1=1,M102+N102,Daten!D$2))","v":""},{"$f":"IF(B102=0,\"\",IF(C102=\"Nein\",\"-\",Daten!D$6))","v":""},{"$f":"IF(B102=0,\"\",IF(C102=\"Nein\",\"-\",Daten!D$3))","v":""},{"$f":"IF(B102=0,\"\",Daten!D$4)","v":""},{"$f":"IF(B102=0,\"\",IF(C102=\"Nein\",\"-\",Daten!D$5))","v":""},{"$f":"IF(B102=0,\"\",IF(Daten!F$1=\"Keine\",Daten!A$45,IF(Daten!F$7=TRUE,Daten!A$48,Daten!A$44)))","v":""},{"$f":"IF(B102=0,\"\",IF(AB102=\"Standard\",IF(Daten!F$9=TRUE,1,0),0))","v":""},"",{"$f":"IF(B102=0,\"\",IF(OR(AB102=Daten!A$46,AB102=Daten!A$47,AB102=Daten!A$48),AI102+W102,\"-\"))","v":""},{"$f":"IF(B102=0,\"\",IF(AB102=Daten!A$45,\"-\",Daten!F$5))","v":""},{"$f":"IF(B102=0,\"\",IF(AB102=Daten!A$45,\"-\",Daten!F$4))","v":""},{"$f":"IF(B102=0,\"\",IF(AB102=Daten!A$45,\"-\",Daten!F$6))","v":""},{"$f":"IF(B102=0,\"\",IF(AB102=Daten!A$45,\"-\",Daten!F$2))","v":""},{"$f":"IF(B102=0,\"\",IF(AB102=Daten!A$45,\"-\",Daten!F$3))","v":""},"",{"$f":"IF(B102=0,\"\",IF(OR(C102=\"Nein\",Daten!D107=\"Ohne\"),\"-\",Daten!D$9))","v":""},{"$f":"IF(B102=0,\"\",IF(OR(C102=\"Nein\",Daten!D107=\"Ohne\"),\"-\",IF(Daten!D$8=\"Rahmendämmung\",Daten!D$10,\"-\")))","v":""},{"$f":"IF(B102=0,\"\",IF(AND(C102=\"Ja\",Daten!D$15=TRUE),Daten!D$16,\"-\"))","v":""},{"$f":"IF(AN102=\"\",\"\",IF(AND(C102=\"Ja\",Daten!D$15=TRUE),Daten!D$18,\"-\"))","v":""},{"$f":"IF(B102=0,\"\",IF(Daten!H$7=TRUE,\"bauseits\",IF(Daten!H$8=TRUE,\"FSP 40\",\"WSP 40\")))","v":""},{"$f":"IF(B102=0,\"\",Daten!H$10)","v":""},{"$f":"IFERROR(IF(B102=0,\"\",IF(Daten!H$2=TRUE,1,0)*IF(J102+P102+P102+Q102+Q102>Daten!B$62,0,1)*IF(K102+P102+Z102+AF102+10>Daten!B$62,0,1)),0)","v":""}]
[null,null,{"$f":"IF(A103=\"\",\"\",IF(Daten!D$1<>\"Keine\",\"Ja\",\"Nein\"))","v":""},{"$f":"IF(A103=\"\",\"\",IF(Daten!B$4=TRUE,\"QB\",\"BS\")&IF(AR103=1,\"G\",\"\")&IF(C103=\"Nein\",\"-V\",IF(Daten!D$11=TRUE,\"-S\",\"-H\"))&IF(Daten!B$1=TRUE,\"-E\",\"\")&IF(Daten!F$9=TRUE,\"-B\",\"\")&IF(Daten!F$8=TRUE,\"A\",\"\"))","v":""},{"$f":"IF(A103=\"\",\"\",IFERROR(VLOOKUP(D103,Daten!D$43:G$94,2,FALSE),\"spez.\"))","v":""},null,null,null,null,{"$f":"IF(F103<>\"\",F103+(2*(Daten!B$13+2)),IF(H103<>\"\",H103-10,\"\"))","v":""},{"$f":"IFERROR(IF(G103<>\"\",G103+Daten!B$14+Daten!B$15+2+IF(AG103=\"-\",0,AG103),IF(I103<>\"\",I103-5,\"\")),\"\")","v":""},{"$f":"IF(B103=0,\"\",IF(L$1=0,0,Daten!B$10))","v":""},{"$f":"IF(B103=0,\"\",IF(M$1=0,0,Daten!B$11))","v":""},{"$f":"IF(B103=0,\"\",IF(N$1=0,0,Daten!B$12))","v":""},"",{"$f":"IF(B103=0,\"\",Daten!B$6)","v":""},{"$f":"IF(B103=0,\"\",Daten!B$16)","v":""},{"$f":"IF(B103=0,\"\",IF(Daten!B$1=TRUE,Daten!B$17,\"-\"))","v":""},{"$f":"IF(B103=0,\"\",IF(C103=\"Nein\",\"-\",Daten!D$7))","v":""},{"$f":"IF(B103=\"\",\"\",IF(C103=\"Nein\",\"-\",IF(T$1=0,\"\",Daten!D$12)))","v":""},{"$f":"IF(B103=\"\",\"\",IF(C103=\"Nein\",\"-\",IF(T$1=0,\"\",Daten!D$13)))","v":""},{"$f":"IF(B103=\"\",\"\",IF(C103=\"Nein\",\"-\",IF(T$1=0,\"\",IF(AK103=\"\",\"\",AK103+X103-Daten!D$20))))","v":""},{"$f":"IF(B103=0,\"\",IF(L$1=1,M103+N103,Daten!D$2))","v":""},{"$f":"IF(B103=0,\"\",IF(C103=\"Nein\",\"-\",Daten!D$6))","v":""},{"$f":"IF(B103=0,\"\",IF(C103=\"Nein\",\"-\",Daten!D$3))","v":""},{"$f":"IF(B103=0,\"\",Daten!D$4)","v":""},{"$f":"IF(B103=0,\"\",IF(C103=\"Nein\",\"-\",Daten!D$5))","v":""},{"$f":"IF(B103=0,\"\",IF(Daten!F$1=\"Keine\",Daten!A$45,IF(Daten!F$7=TRUE,Daten!A$48,Daten!A$44)))","v":""},{"$f":"IF(B103=0,\"\",IF(AB103=\"Standard\",IF(Daten!F$9=TRUE,1,0),0))","v":""},"",{"$f":"IF(B103=0,\"\",IF(OR(AB103=Daten!A$46,AB103=Daten!A$47,AB103=Daten!A$48),AI103+W103,\"-\"))","v":""},{"$f":"IF(B103=0,\"\",IF(AB103=Daten!A$45,\"-\",Daten!F$5))","v":""},{"$f":"IF(B103=0,\"\",IF(AB103=Daten!A$45,\"-\",Daten!F$4))","v":""},{"$f":"IF(B103=0,\"\",IF(AB103=Daten!A$45,\"-\",Daten!F$6))","v":""},{"$f":"IF(B103=0,\"\",IF(AB103=Daten!A$45,\"-\",Daten!F$2))","v":""},{"$f":"IF(B103=0,\"\",IF(AB103=Daten!A$45,\"-\",Daten!F$3))","v":""},"",{"$f":"IF(B103=0,\"\",IF(OR(C103=\"Nein\",Daten!D108=\"Ohne\"),\"-\",Daten!D$9))","v":""},{"$f":"IF(B103=0,\"\",IF(OR(C103=\"Nein\",Daten!D108=\"Ohne\"),\"-\",IF(Daten!D$8=\"Rahmendämmung\",Daten!D$10,\"-\")))","v":""},{"$f":"IF(B103=0,\"\",IF(AND(C103=\"Ja\",Daten!D$15=TRUE),Daten!D$16,\"-\"))","v":""},{"$f":"IF(AN103=\"\",\"\",IF(AND(C103=\"Ja\",Daten!D$15=TRUE),Daten!D$18,\"-\"))","v":""},{"$f":"IF(B103=0,\"\",IF(Daten!H$7=TRUE,\"bauseits\",IF(Daten!H$8=TRUE,\"FSP 40\",\"WSP 40\")))","v":""},{"$f":"IF(B103=0,\"\",Daten!H$10)","v":""},{"$f":"IFERROR(IF(B103=0,\"\",IF(Daten!H$2=TRUE,1,0)*IF(J103+P103+P103+Q103+Q103>Daten!B$62,0,1)*IF(K103+P103+Z103+AF103+10>Daten!B$62,0,1)),0)","v":""}]
[null,null,{"$f":"IF(A104=\"\",\"\",IF(Daten!D$1<>\"Keine\",\"Ja\",\"Nein\"))","v":""},{"$f":"IF(A104=\"\",\"\",IF(Daten!B$4=TRUE,\"QB\",\"BS\")&IF(AR104=1,\"G\",\"\")&IF(C104=\"Nein\",\"-V\",IF(Daten!D$11=TRUE,\"-S\",\"-H\"))&IF(Daten!B$1=TRUE,\"-E\",\"\")&IF(Daten!F$9=TRUE,\"-B\",\"\")&IF(Daten!F$8=TRUE,\"A\",\"\"))","v":""},{"$f":"IF(A104=\"\",\"\",IFERROR(VLOOKUP(D104,Daten!D$43:G$94,2,FALSE),\"spez.\"))","v":""},null,null,null,null,{"$f":"IF(F104<>\"\",F104+(2*(Daten!B$13+2)),IF(H104<>\"\",H104-10,\"\"))","v":""},{"$f":"IFERROR(IF(G104<>\"\",G104+Daten!B$14+Daten!B$15+2+IF(AG104=\"-\",0,AG104),IF(I104<>\"\",I104-5,\"\")),\"\")","v":""},{"$f":"IF(B104=0,\"\",IF(L$1=0,0,Daten!B$10))","v":""},{"$f":"IF(B104=0,\"\",IF(M$1=0,0,Daten!B$11))","v":""},{"$f":"IF(B104=0,\"\",IF(N$1=0,0,Daten!B$12))","v":""},"",{"$f":"IF(B104=0,\"\",Daten!B$6)","v":""},{"$f":"IF(B104=0,\"\",Daten!B$16)","v":""},{"$f":"IF(B104=0,\"\",IF(Daten!B$1=TRUE,Daten!B$17,\"-\"))","v":""},{"$f":"IF(B104=0,\"\",IF(C104=\"Nein\",\"-\",Daten!D$7))","v":""},{"$f":"IF(B104=\"\",\"\",IF(C104=\"Nein\",\"-\",IF(T$1=0,\"\",Daten!D$12)))","v":""},{"$f":"IF(B104=\"\",\"\",IF(C104=\"Nein\",\"-\",IF(T$1=0,\"\",Daten!D$13)))","v":""},{"$f":"IF(B104=\"\",\"\",IF(C104=\"Nein\",\"-\",IF(T$1=0,\"\",IF(AK104=\"\",\"\",AK104+X104-Daten!D$20))))","v":""},{"$f":"IF(B104=0,\"\",IF(L$1=1,M104+N104,Daten!D$2))","v":""},{"$f":"IF(B104=0,\"\",IF(C104=\"Nein\",\"-\",Daten!D$6))","v":""},{"$f":"IF(B104=0,\"\",IF(C104=\"Nein\",\"-\",Daten!D$3))","v":""},{"$f":"IF(B104=0,\"\",Daten!D$4)","v":""},{"$f":"IF(B104=0,\"\",IF(C104=\"Nein\",\"-\",Daten!D$5))","v":""},{"$f":"IF(B104=0,\"\",IF(Daten!F$1=\"Keine\",Daten!A$45,IF(Daten!F$7=TRUE,Daten!A$48,Daten!A$44)))","v":""},{"$f":"IF(B104=0,\"\",IF(AB104=\"Standard\",IF(Daten!F$9=TRUE,1,0),0))","v":""},"",{"$f":"IF(B104=0,\"\",IF(OR(AB104=Daten!A$46,AB104=Daten!A$47,AB104=Daten!A$48),AI104+W104,\"-\"))","v":""},{"$f":"IF(B104=0,\"\",IF(AB104=Daten!A$45,\"-\",Daten!F$5))","v":""},{"$f":"IF(B104=0,\"\",IF(AB104=Daten!A$45,\"-\",Daten!F$4))","v":""},{"$f":"IF(B104=0,\"\",IF(AB104=Daten!A$45,\"-\",Daten!F$6))","v":""},{"$f":"IF(B104=0,\"\",IF(AB104=Daten!A$45,\"-\",Daten!F$2))","v":""},{"$f":"IF(B104=0,\"\",IF(AB104=Daten!A$45,\"-\",Daten!F$3))","v":""},"",{"$f":"IF(B104=0,\"\",IF(OR(C104=\"Nein\",Daten!D109=\"Ohne\"),\"-\",Daten!D$9))","v":""},{"$f":"IF(B104=0,\"\",IF(OR(C104=\"Nein\",Daten!D109=\"Ohne\"),\"-\",IF(Daten!D$8=\"Rahmendämmung\",Daten!D$10,\"-\")))","v":""},{"$f":"IF(B104=0,\"\",IF(AND(C104=\"Ja\",Daten!D$15=TRUE),Daten!D$16,\"-\"))","v":""},{"$f":"IF(AN104=\"\",\"\",IF(AND(C104=\"Ja\",Daten!D$15=TRUE),Daten!D$18,\"-\"))","v":""},{"$f":"IF(B104=0,\"\",IF(Daten!H$7=TRUE,\"bauseits\",IF(Daten!H$8=TRUE,\"FSP 40\",\"WSP 40\")))","v":""},{"$f":"IF(B104=0,\"\",Daten!H$10)","v":""},{"$f":"IFERROR(IF(B104=0,\"\",IF(Daten!H$2=TRUE,1,0)*IF(J104+P104+P104+Q104+Q104>Daten!B$62,0,1)*IF(K104+P104+Z104+AF104+10>Daten!B$62,0,1)),0)","v":""}]
[null,null,{"$f":"IF(A105=\"\",\"\",IF(Daten!D$1<>\"Keine\",\"Ja\",\"Nein\"))","v":""},{"$f":"IF(A105=\"\",\"\",IF(Daten!B$4=TRUE,\"QB\",\"BS\")&IF(AR105=1,\"G\",\"\")&IF(C105=\"Nein\",\"-V\",IF(Daten!D$11=TRUE,\"-S\",\"-H\"))&IF(Daten!B$1=TRUE,\"-E\",\"\")&IF(Daten!F$9=TRUE,\"-B\",\"\")&IF(Daten!F$8=TRUE,\"A\",\"\"))","v":""},{"$f":"IF(A105=\"\",\"\",IFERROR(VLOOKUP(D105,Daten!D$43:G$94,2,FALSE),\"spez.\"))","v":""},null,null,null,null,{"$f":"IF(F105<>\"\",F105+(2*(Daten!B$13+2)),IF(H105<>\"\",H105-10,\"\"))","v":""},{"$f":"IFERROR(IF(G105<>\"\",G105+Daten!B$14+Daten!B$15+2+IF(AG105=\"-\",0,AG105),IF(I105<>\"\",I105-5,\"\")),\"\")","v":""},{"$f":"IF(B105=0,\"\",IF(L$1=0,0,Daten!B$10))","v":""},{"$f":"IF(B105=0,\"\",IF(M$1=0,0,Daten!B$11))","v":""},{"$f":"IF(B105=0,\"\",IF(N$1=0,0,Daten!B$12))","v":""},"",{"$f":"IF(B105=0,\"\",Daten!B$6)","v":""},{"$f":"IF(B105=0,\"\",Daten!B$16)","v":""},{"$f":"IF(B105=0,\"\",IF(Daten!B$1=TRUE,Daten!B$17,\"-\"))","v":""},{"$f":"IF(B105=0,\"\",IF(C105=\"Nein\",\"-\",Daten!D$7))","v":""},{"$f":"IF(B105=\"\",\"\",IF(C105=\"Nein\",\"-\",IF(T$1=0,\"\",Daten!D$12)))","v":""},{"$f":"IF(B105=\"\",\"\",IF(C105=\"Nein\",\"-\",IF(T$1=0,\"\",Daten!D$13)))","v":""},{"$f":"IF(B105=\"\",\"\",IF(C105=\"Nein\",\"-\",IF(T$1=0,\"\",IF(AK105=\"\",\"\",AK105+X105-Daten!D$20))))","v":""},{"$f":"IF(B105=0,\"\",IF(L$1=1,M105+N105,Daten!D$2))","v":""},{"$f":"IF(B105=0,\"\",IF(C105=\"Nein\",\"-\",Daten!D$6))","v":""},{"$f":"IF(B105=0,\"\",IF(C105=\"Nein\",\"-\",Daten!D$3))","v":""},{"$f":"IF(B105=0,\"\",Daten!D$4)","v":""},{"$f":"IF(B105=0,\"\",IF(C105=\"Nein\",\"-\",Daten!D$5))","v":""},{"$f":"IF(B105=0,\"\",IF(Daten!F$1=\"Keine\",Daten!A$45,IF(Daten!F$7=TRUE,Daten!A$48,Daten!A$44)))","v":""},{"$f":"IF(B105=0,\"\",IF(AB105=\"Standard\",IF(Daten!F$9=TRUE,1,0),0))","v":""},"",{"$f":"IF(B105=0,\"\",IF(OR(AB105=Daten!A$46,AB105=Daten!A$47,AB105=Daten!A$48),AI105+W105,\"-\"))","v":""},{"$f":"IF(B105=0,\"\",IF(AB105=Daten!A$45,\"-\",Daten!F$5))","v":""},{"$f":"IF(B105=0,\"\",IF(AB105=Daten!A$45,\"-\",Daten!F$4))","v":""},{"$f":"IF(B105=0,\"\",IF(AB105=Daten!A$45,\"-\",Daten!F$6))","v":""},{"$f":"IF(B105=0,\"\",IF(AB105=Daten!A$45,\"-\",Daten!F$2))","v":""},{"$f":"IF(B105=0,\"\",IF(AB105=Daten!A$45,\"-\",Daten!F$3))","v":""},"",{"$f":"IF(B105=0,\"\",IF(OR(C105=\"Nein\",Daten!D110=\"Ohne\"),\"-\",Daten!D$9))","v":""},{"$f":"IF(B105=0,\"\",IF(OR(C105=\"Nein\",Daten!D110=\"Ohne\"),\"-\",IF(Daten!D$8=\"Rahmendämmung\",Daten!D$10,\"-\")))","v":""},{"$f":"IF(B105=0,\"\",IF(AND(C105=\"Ja\",Daten!D$15=TRUE),Daten!D$16,\"-\"))","v":""},{"$f":"IF(AN105=\"\",\"\",IF(AND(C105=\"Ja\",Daten!D$15=TRUE),Daten!D$18,\"-\"))","v":""},{"$f":"IF(B105=0,\"\",IF(Daten!H$7=TRUE,\"bauseits\",IF(Daten!H$8=TRUE,\"FSP 40\",\"WSP 40\")))","v":""},{"$f":"IF(B105=0,\"\",Daten!H$10)","v":""},{"$f":"IFERROR(IF(B105=0,\"\",IF(Daten!H$2=TRUE,1,0)*IF(J105+P105+P105+Q105+Q105>Daten!B$62,0,1)*IF(K105+P105+Z105+AF105+10>Daten!B$62,0,1)),0)","v":""}]
[null,null,{"$f":"IF(A106=\"\",\"\",IF(Daten!D$1<>\"Keine\",\"Ja\",\"Nein\"))","v":""},{"$f":"IF(A106=\"\",\"\",IF(Daten!B$4=TRUE,\"QB\",\"BS\")&IF(AR106=1,\"G\",\"\")&IF(C106=\"Nein\",\"-V\",IF(Daten!D$11=TRUE,\"-S\",\"-H\"))&IF(Daten!B$1=TRUE,\"-E\",\"\")&IF(Daten!F$9=TRUE,\"-B\",\"\")&IF(Daten!F$8=TRUE,\"A\",\"\"))","v":""},{"$f":"IF(A106=\"\",\"\",IFERROR(VLOOKUP(D106,Daten!D$43:G$94,2,FALSE),\"spez.\"))","v":""},null,null,null,null,{"$f":"IF(F106<>\"\",F106+(2*(Daten!B$13+2)),IF(H106<>\"\",H106-10,\"\"))","v":""},{"$f":"IFERROR(IF(G106<>\"\",G106+Daten!B$14+Daten!B$15+2+IF(AG106=\"-\",0,AG106),IF(I106<>\"\",I106-5,\"\")),\"\")","v":""},{"$f":"IF(B106=0,\"\",IF(L$1=0,0,Daten!B$10))","v":""},{"$f":"IF(B106=0,\"\",IF(M$1=0,0,Daten!B$11))","v":""},{"$f":"IF(B106=0,\"\",IF(N$1=0,0,Daten!B$12))","v":""},"",{"$f":"IF(B106=0,\"\",Daten!B$6)","v":""},{"$f":"IF(B106=0,\"\",Daten!B$16)","v":""},{"$f":"IF(B106=0,\"\",IF(Daten!B$1=TRUE,Daten!B$17,\"-\"))","v":""},{"$f":"IF(B106=0,\"\",IF(C106=\"Nein\",\"-\",Daten!D$7))","v":""},{"$f":"IF(B106=\"\",\"\",IF(C106=\"Nein\",\"-\",IF(T$1=0,\"\",Daten!D$12)))","v":""},{"$f":"IF(B106=\"\",\"\",IF(C106=\"Nein\",\"-\",IF(T$1=0,\"\",Daten!D$13)))","v":""},{"$f":"IF(B106=\"\",\"\",IF(C106=\"Nein\",\"-\",IF(T$1=0,\"\",IF(AK106=\"\",\"\",AK106+X106-Daten!D$20))))","v":""},{"$f":"IF(B106=0,\"\",IF(L$1=1,M106+N106,Daten!D$2))","v":""},{"$f":"IF(B106=0,\"\",IF(C106=\"Nein\",\"-\",Daten!D$6))","v":""},{"$f":"IF(B106=0,\"\",IF(C106=\"Nein\",\"-\",Daten!D$3))","v":""},{"$f":"IF(B106=0,\"\",Daten!D$4)","v":""},{"$f":"IF(B106=0,\"\",IF(C106=\"Nein\",\"-\",Daten!D$5))","v":""},{"$f":"IF(B106=0,\"\",IF(Daten!F$1=\"Keine\",Daten!A$45,IF(Daten!F$7=TRUE,Daten!A$48,Daten!A$44)))","v":""},{"$f":"IF(B106=0,\"\",IF(AB106=\"Standard\",IF(Daten!F$9=TRUE,1,0),0))","v":""},"",{"$f":"IF(B106=0,\"\",IF(OR(AB106=Daten!A$46,AB106=Daten!A$47,AB106=Daten!A$48),AI106+W106,\"-\"))","v":""},{"$f":"IF(B106=0,\"\",IF(AB106=Daten!A$45,\"-\",Daten!F$5))","v":""},{"$f":"IF(B106=0,\"\",IF(AB106=Daten!A$45,\"-\",Daten!F$4))","v":""},{"$f":"IF(B106=0,\"\",IF(AB106=Daten!A$45,\"-\",Daten!F$6))","v":""},{"$f":"IF(B106=0,\"\",IF(AB106=Daten!A$45,\"-\",Daten!F$2))","v":""},{"$f":"IF(B106=0,\"\",IF(AB106=Daten!A$45,\"-\",Daten!F$3))","v":""},"",{"$f":"IF(B106=0,\"\",IF(OR(C106=\"Nein\",Daten!D111=\"Ohne\"),\"-\",Daten!D$9))","v":""},{"$f":"IF(B106=0,\"\",IF(OR(C106=\"Nein\",Daten!D111=\"Ohne\"),\"-\",IF(Daten!D$8=\"Rahmendämmung\",Daten!D$10,\"-\")))","v":""},{"$f":"IF(B106=0,\"\",IF(AND(C106=\"Ja\",Daten!D$15=TRUE),Daten!D$16,\"-\"))","v":""},{"$f":"IF(AN106=\"\",\"\",IF(AND(C106=\"Ja\",Daten!D$15=TRUE),Daten!D$18,\"-\"))","v":""},{"$f":"IF(B106=0,\"\",IF(Daten!H$7=TRUE,\"bauseits\",IF(Daten!H$8=TRUE,\"FSP 40\",\"WSP 40\")))","v":""},{"$f":"IF(B106=0,\"\",Daten!H$10)","v":""},{"$f":"IFERROR(IF(B106=0,\"\",IF(Daten!H$2=TRUE,1,0)*IF(J106+P106+P106+Q106+Q106>Daten!B$62,0,1)*IF(K106+P106+Z106+AF106+10>Daten!B$62,0,1)),0)","v":""}]

{"sheet":"Daten","index":2,"n_rows":72,"n_cols":13,"rows_kept":72,"cut":false,"hidden":true,"merged":[]}
["Entwässerung",true,"Storenöffnung","Keine","Fensterbank?","Keine","Gesteckt",true,"Dichtunsband",false,"Firma","Firmenname"]
["Keine Entw.",false,"ST",60,"Ue",10,"Geschweisst",false,"Dichtungsband",null,"Ansprechperson"]
[null,null,"AS",3,"VFB",0,"Beschrieb","Gesteckte Ausführung - der FEBA-Standard: Preiswert, rasch Verfügbar, günstige Lieferung","Flex 290",false,"Telefonnummer","Telefonnummer"]
["Quetschbug",true,"HS2",35,"Ha",12,"Oberfläche","Pulverbeschichtet RAL","Flex 290",null,"Objekt"]
["Spiegel",false,"HS1",20,"Va",50,"Farbton","Farbton?","Flex 600",false,"Wunschtermin","??.??.??"]
["BS",7,"SL",135,"Gefälle",5,"Matt",false,"Flex 600",null,"Lieferadresse","Lieferadresse"]
["Direkte Masseing.",true,"LH",50,"Streifbank?",false,"Bauseits?",false,"PU 310",false,"Bemerkung"]
["Ausmass Fenster",false,"RD?",null,"Ausschnitt?",false,"Flachsteck?",true,"Pu 310",null,"Montage",false,{"$f":"IF(L8=FALSE,\"OHNE Montage\",\"MIT Montage\")","v":"OHNE Montage"}]
["Ausmass Futter",false,"RV",50,"FB geschl.?",false,"Winkelsteck?",false,"7.5x50",null,"Lieferart","ab Werk"]
["C","??","RH",null,"Streifbank A",null,"LSP",10,"7.5x50",false,"Ausmass",false,{"$f":"IF(L10=FALSE,\"OHNE Ausmass\",\"MIT Ausmass\")","v":"OHNE Ausmass"}]
["HL","??","Versenkte SF?",false,"Alle gleich",true,"FSP 25",false,"7.5x70"]
["UZ",10,"X",25,null,null,"WSP 25",false,"7.5x70",false]
["RS","??","Y",25,null,null,null,null,"7.5x110"]
["RO","??","CS","67,5",null,null,null,null,"7.5x110",false]
["RU","??","ISO?",false,null,null,null,null,"4.2x19"]
["BF",25,"Mat ISO",null,null,null,null,null,"4.2x19",false]
["ET",12,"Stärke ISO",null,null,null,null,null,"4.2x38"]
[null,null,"Höhe ISO",300,null,null,null,null,"4.2x38",false]
[null,null,"Tiefe RD",{"$f":"IF(OR(D16=\"XPS\",D16=\"PIR\"),5,4)+D17","v":4}]
[null,null,"Z (CS ab ST)","67,5",null,null,null,null,"Offerte \"O\"/Bestellung \"B\"","O"]
[]
[]
[]
[]
[]
[]
[]
[]
[]
[]
[]
[]
[]
[]
[]
[]
[]
[]
[]
[{"$f":"IF(B4=TRUE,\"QB\",\"BS\")&IF(D1=\"Keine\",\"-V\",IF(D11=TRUE,\"-S\",\"-H\"))&IF(B1=TRUE,\"-E\",\"\")&IF(F9=TRUE,\"-B\",\"\")&IF(F8=TRUE,\"A\",\"\")","v":"QB-V-E"},{"$f":"VLOOKUP(A40,D43:G94,2,FALSE)","v":212.02099999999999}]
["Ja"]
["Nein"]
["Fensterbank",null,null,"QB-V","212.020"]
["Standard",null,null,"QB-V-E",212.02099999999999]
["Ohne (Türzarge)",null,null,"QB-H",212.02199999999999]
["Streifbank Li",null,null,"QB-S",212.023]
["Streifbank Re",null,null,"QB-H-E",212.024]
["Streifbank Li+Re",null,null,"QB-S-E","212.025"]
["Reiskornbank (roh)",null,null,"QB-V-EA","212.026"]
[null,null,null,"QB-H-EA","212.027"]
[null,null,null,"BS-V","212.035"]
[null,null,null,"BS-V-B","212.041"]
[null,null,null,"BS-V-E","212.036"]
[null,null,null,"BS-H","212.037"]
[null,null,null,"BS-H-B","212.042"]
[null,null,null,"BS-S","212.038"]
[null,null,null,"BS-S-B","212.043"]
[null,null,null,"BS-H-E","212.039"]
[null,null,null,"BS-S-E","212.040"]
[null,null,null,"QBG-V","212.050"]
["Geschweisst",null,null,"QBG-V-E","212.051"]
["Breite Höhe",2500,null,"QBG-H","212.052"]
[null,null,null,"QBG-S","212.053"]
[null,null,null,"QBG-H-E","212.054"]
[null,null,null,"QBG-S-E","212.055"]
[null,null,null,"BSG-V","212.060"]
[null,null,null,"BSG-V-E","212.061"]
[null,null,null,"BSG-H","212.062"]
[null,null,null,"BSG-S","212.063"]
[null,null,null,"BSG-H-E","212.064"]
[null,null,null,"BSG-S-E","212.065"]
[null,null,null,"BSG-J-E","212.066"]