{"text_format":"1","workbook":"xlsx","n_sheets":3,"sheets":["Ausgabe","Eingabeliste","Daten"],"not_rendered":{"charts":0,"images":4,"macros":1,"external_links":0,"defined_names":2,"comments":0,"pivot_tables":0},"unopened":[],"bounds":{"document_bytes":16777216,"sheet_cells":100000,"rows_first":2000,"rows_last":500,"rows_between":2000,"halvings":0,"cell_chars":16384,"cell_head_chars":4096},"cells_cut":0,"cells_raw":0,"read":"whole","date_system":"1900"}

{"sheet":"Ausgabe","index":0,"n_rows":40,"n_cols":8,"rows_kept":40,"cut":false,"hidden":true,"merged":[[28,1,28,7],[29,1,29,3],[30,1,30,3],[31,1,31,3],[32,1,32,3],[24,1,24,7],[26,1,26,7],[9,6,9,7],[9,3,9,4],[10,3,10,4],[10,5,10,7],[40,1,40,3],[10,1,10,2],[7,1,7,2],[6,1,6,2],[27,2,27,3],[38,1,38,7],[39,1,39,7],[12,1,12,7],[15,1,15,7],[19,1,19,7],[25,2,25,3],[34,1,34,3],[35,1,35,3],[36,1,36,3],[37,1,37,3],[33,1,33,3],[0,1,0,5],[4,1,4,2],[9,1,9,2],[2,1,2,2],[1,1,1,2],[6,5,6,7],[4,3,4,7],[2,5,2,7],[1,3,1,7],[2,3,2,4]]}
[null,{"$f":"IF(Daten!J20=\"B\",\"Bestellung Standardzargen\",\"Preisanfrage Standardzargen \"& Daten!M10&\" / \"&Daten!M8)","v":"Preisanfrage Standardzargen OHNE Ausmass / OHNE Montage"}]
[null,"Firma",null,{"$f":"IF(Daten!L1=0,\"\",Daten!L1)","v":"Firmenname"}]
[null,"Ansprechperson",null,{"$f":"IF(Daten!L2=0,\"\",Daten!L2)","v":""},null,{"$f":"IF(Daten!L3=\"Telefonnummer\",\"\",Daten!L3)","v":""}]
[]
[null,"Objekt",null,{"$f":"IF(Daten!L4=0,\"\",Daten!L4)","v":""}]
[]
[null,"Lieferart",null,{"$f":"Daten!L9","v":"ab Werk"},null,{"$f":"IF(D7=\"ab Werk\",\"\",Daten!L6)","v":""}]
[{"$f":"IF(Daten!J20=\"O\",0,1)","v":0},"Wunschtermin",null,{"$f":"IF(Daten!L5=0,\"\",Daten!L5)","v":"??.??.??"}]
[]
[null,{"$f":"IF(Daten!B4=TRUE,\"Quetschbugzargen\",\"Spiegelzargen\")","v":"Quetschbugzargen"},null,{"$f":"Eingabeliste!B3&\" Stk (\"&COUNTA(Eingabeliste!A6:A106)&\" Positionen)\"","v":"0 Stk (0 Positionen)"}]
{"$rows_left_out":31}
{"sheet":"Eingabeliste","index":1,"n_rows":106,"n_cols":44,"rows_kept":106,"cut":false,"hidden":false,"merged":[[2,27,2,35],[2,36,2,38],[4,3,4,4],[1,15,1,17],[2,15,2,21],[2,22,2,26],[2,5,2,8],[2,11,2,13],[2,3,2,4]]}
[1,1,{"$f":"IF(Daten!D1=\"Teilweise\",1,0)","v":0},1,1,{"$f":"IF(Daten!B8=FALSE,0,1)","v":0},{"$f":"F1","v":0},{"$f":"IF(Daten!B9=FALSE,0,1)","v":0},{"$f":"H1","v":0},1,1,1,{"$f":"IF(Daten!B7=TRUE,0,1)","v":0},{"$f":"M1","v":0},1,{"$f":"IF(Daten!B$4=TRUE,0,1)","v":0},0,0,0,{"$f":"IF(Daten!D$11=TRUE,1,0)","v":0},{"$f":"T1","v":0},{"$f":"U1","v":0},{"$f":"IF(AND(Daten!D1=\"Keine\",Daten!B7=TRUE),0,1)","v":0},{"$f":"IF(Daten!D1=\"Keine\",0,1)","v":0},{"$f":"IF(Daten!D1=\"Keine\",0,1)","v":0},0,0,{"$f":"IF(Daten!F1=\"Keine\",0,1)","v":0},0,{"$f":"AB1","v":0},{"$f":"IF(Daten!F7=TRUE,1,0)","v":0},{"$f":"IF(Daten!F$11=TRUE,0,1)","v":0},{"$f":"IF(Daten!F$11=TRUE,0,1)","v":0},{"$f":"IF(Daten!F$11=TRUE,0,1)","v":0},{"$f":"IF(Daten!F$11=TRUE,0,1)","v":0},{"$f":"IF(Daten!F$11=TRUE,0,1)","v":0},{"$f":"IF(Daten!D1=\"Keine\",0,1)","v":0},{"$f":"AK1","v":0},{"$f":"IF(Daten!D$8=\"Rahmendämmung\",1,0)","v":0},0,0,null,0,0]
[1]
[1,{"$f":"SUM(B6:B106)","v":0},null,null,null,"Ausmass Breite/Höhe",null,null,null,null,null,{"$f":"IF(M1=0,\"\",\"Ausmass Tiefe\")","v":""},null,null,null,"Leibungen",null,null,null,null,null,null,"Sturzblech",null,null,null,null,"Fensterbank",null,null,null,null,null,null,null,null,{"$f":"IF(Daten!D8=\"Ohne\",\"\",Daten!D8)","v":0}]
["Position","Anzahl ","Storenöffnung","Zargentyp","Zeichnung","Rahmenlicht horizontal","Rahmenlicht vertikal","Futterlicht-breite","Futterlicht-höhe","Zargenlicht horizontal","Zargenlicht vertikal","Mass bis Anschlag","Stärke Aufbau ab Anschlag","Überstand über Fassade","Zargentiefe","Spiegelbreite","Breite Rinne","Tiefe Rinne","Höhe Leibung","Breite Storenführung","Tiefe Storenführung","Achsabstand zu Anschlag","Tiefe bis Anschlag","Tiefe Storenkasten","Abstand Sturz","Höhe Sturz vorne","Höhe Sturz hinten","Fensterbank","Geschlossen?","Tiefe Fensterbank","Tiefe Streifbank","Abbordung vorne","Aufbordung hinten","Gefälle","Überstand ","Versatz zu Anschlag","Tiefe RD/SW","Höhe RD/SW","Höhe RD/SW","ISO Material","Höhe ISO","Steckprofile","Luft Steckprofil","Geschweisst"]
["[-]","[Stk]","[-]","[-]",null,"[mm]","[mm]","[mm]","[mm]","ZLh [mm]","ZLv [mm]","C [mm]","HL [mm]","Uz [mm]","ZT [mm]","SB [mm]","BF [mm]","ET [mm]","LH [mm]","X [mm]","Y [mm]","CS [mm]","ST [mm]","SL [mm]","AS [mm]","HS2 [mm]","HS1 [mm]","[-]","[0/1]","A [mm]","As [mm]","Va [mm]","Ha [mm]","α [mm]","Ue [mm]","VFB [mm]","RT [mm]","RV [mm]","RH [mm]","[-]","H [mm]","[-]","LSP [mm]","[0/1]"]
[null,null,{"$f":"IF(A6=\"\",\"\",IF(Daten!D$1<>\"Keine\",\"Ja\",\"Nein\"))","v":""},{"$f":"IF(A6=\"\",\"\",IF(Daten!B$4=TRUE,\"QB\",\"BS\")&IF(AR6=1,\"G\",\"\")&IF(C6=\"Nein\",\"-V\",IF(Daten!D$11=TRUE,\"-S\",\"-H\"))&IF(Daten!B$1=TRUE,\"-E\",\"\")&IF(Daten!F$9=TRUE,\"-B\",\"\")&IF(Daten!F$8=TRUE,\"A\",\"\"))","v":""},{"$f":"IF(A6=\"\",\"\",IFERROR(VLOOKUP(D6,Daten!D$43:G$94,2,FALSE),\"spez.\"))","v":""},null,null,null,null,{"$f":"IF(F6<>\"\",F6+(2*(Daten!B$13+2)),IF(H6<>\"\",H6-10,\"\"))","v":""},{"$f":"IFERROR(IF(G6<>\"\",G6+Daten!B$14+Daten!B$15+2+IF(AG6=\"-\",0,AG6),IF(I6<>\"\",I6-5,\"\")),\"\")","v":""},{"$f":"IF(B6=0,\"\",IF(L$1=0,0,Daten!B$10))","v":""},{"$f":"IF(B6=0,\"\",IF(M$1=0,0,Daten!B$11))","v":""},{"$f":"IF(B6=0,\"\",IF(N$1=0,0,Daten!B$12))","v":""},{"$f":"IFERROR(IF(OR(A6=\"\",B6=0),\"\",IF(M$1=1,L6+M6+N6,\"\")),\"\")","v":""},{"$f":"IF(B6=0,\"\",Daten!B$6)","v":""},{"$f":"IF(B6=0,\"\",Daten!B$16)","v":""},{"$f":"IF(B6=0,\"\",IF(Daten!B$1=TRUE,Daten!B$17,\"-\"))","v":""},{"$f":"IF(B6=0,\"\",IF(C6=\"Nein\",\"-\",Daten!D$7))","v":""},{"$f":"IF(B6=\"\",\"\",IF(C6=\"Nein\",\"-\",IF(T$1=0,\"\",Daten!D$12)))","v":""},{"$f":"IF(B6=\"\",\"\",IF(C6=\"Nein\",\"-\",IF(T$1=0,\"\",Daten!D$13)))","v":""},{"$f":"IF(B6=\"\",\"\",IF(C6=\"Nein\",\"-\",IF(T$1=0,\"\",IF(AK6=\"\",\"\",AK6+X6-Daten!D$20))))","v":""},{"$f":"IF(B6=0,\"\",IF(L$1=1,M6+N6,Daten!D$2))","v":""},{"$f":"IF(B6=0,\"\",IF(C6=\"Nein\",\"-\",Daten!D$6))","v":""},{"$f":"IF(B6=0,\"\",IF(C6=\"Nein\",\"-\",Daten!D$3))","v":""},{"$f":"IF(B6=0,\"\",Daten!D$4)","v":""},{"$f":"IF(B6=0,\"\",IF(C6=\"Nein\",\"-\",Daten!D$5))","v":""},{"$f":"IF(B6=0,\"\",IF(Daten!F$1=\"Keine\",Daten!A$45,IF(Daten!F$7=TRUE,Daten!A$48,Daten!A$44)))","v":""},{"$f":"IF(B6=0,\"\",IF(AB6=\"Standard\",IF(Daten!F$9=TRUE,1,0),0))","v":""},{"$f":"IFERROR(O6+AI6+AJ6,\"\")","v":""},{"$f":"IF(B6=0,\"\",IF(OR(AB6=Daten!A$46,AB6=Daten!A$47,AB6=Daten!A$48),AI6+W6,\"-\"))","v":""},{"$f":"IF(B6=0,\"\",IF(AB6=Daten!A$45,\"-\",Daten!F$5))","v":""},{"$f":"IF(B6=0,\"\",IF(AB6=Daten!A$45,\"-\",Daten!F$4))","v":""},{"$f":"IF(B6=0,\"\",IF(AB6=Daten!A$45,\"-\",Daten!F$6))","v":""},{"$f":"IF(B6=0,\"\",IF(AB6=Daten!A$45,\"-\",Daten!F$2))","v":""},{"$f":"IF(B6=0,\"\",IF(AB6=Daten!A$45,\"-\",Daten!F$3))","v":""},{"$f":"IF(B6=0,\"\",IFERROR(IF(C6=\"Nein\",\"-\",O6-X6-Y6-W6),\"\"))","v":""},{"$f":"IF(B6=0,\"\",IF(OR(C6=\"Nein\",Daten!D8=\"Ohne\"),\"-\",Daten!D$9))","v":""},{"$f":"IF(B6=0,\"\",IF(OR(C6=\"Nein\",Daten!D8=\"Ohne\"),\"-\",IF(Daten!D$8=\"Rahmendämmung\",Daten!D$10,\"-\")))","v":""},{"$f":"IF(B6=0,\"\",IF(AND(C6=\"Ja\",Daten!D$15=TRUE),Daten!D$16,\"-\"))","v":""},{"$f":"IF(AN6=\"\",\"\",IF(AND(C6=\"Ja\",Daten!D$15=TRUE),Daten!D$18,\"-\"))","v":""},{"$f":"IF(B6=0,\"\",IF(Daten!H$7=TRUE,\"bauseits\",IF(Daten!H$8=TRUE,\"FSP 40\",\"WSP 40\")))","v":""},{"$f":"IF(B6=0,\"\",Daten!H$10)","v":""},{"$f":"IFERROR(IF(B6=0,\"\",IF(Daten!H$2=TRUE,1,0)*IF(J6+P6+P6+Q6+Q6>Daten!B$62,0,1)*IF(K6+P6+Z6+AF6+10>Daten!B$62,0,1)),0)","v":""}]
[null,null,{"$f":"IF(A7=\"\",\"\",IF(Daten!D$1<>\"Keine\",\"Ja\",\"Nein\"))","v":""},{"$f":"IF(A7=\"\",\"\",IF(Daten!B$4=TRUE,\"QB\",\"BS\")&IF(AR7=1,\"G\",\"\")&IF(C7=\"Nein\",\"-V\",IF(Daten!D$11=TRUE,\"-S\",\"-H\"))&IF(Daten!B$1=TRUE,\"-E\",\"\")&IF(Daten!F$9=TRUE,\"-B\",\"\")&IF(Daten!F$8=TRUE,\"A\",\"\"))","v":""},{"$f":"IF(A7=\"\",\"\",IFERROR(VLOOKUP(D7,Daten!D$43:G$94,2,FALSE),\"spez.\"))","v":""},null,null,null,null,{"$f":"IF(F7<>\"\",F7+(2*(Daten!B$13+2)),IF(H7<>\"\",H7-10,\"\"))","v":""},{"$f":"IFERROR(IF(G7<>\"\",G7+Daten!B$14+Daten!B$15+2+IF(AG7=\"-\",0,AG7),IF(I7<>\"\",I7-5,\"\")),\"\")","v":""},{"$f":"IF(B7=0,\"\",IF(L$1=0,0,Daten!B$10))","v":""},{"$f":"IF(B7=0,\"\",IF(M$1=0,0,Daten!B$11))","v":""},{"$f":"IF(B7=0,\"\",IF(N$1=0,0,Daten!B$12))","v":""},{"$f":"IFERROR(IF(OR(A7=\"\",B7=0),\"\",IF(M$1=1,L7+M7+N7,\"\")),\"\")","v":""},{"$f":"IF(B7=0,\"\",Daten!B$6)","v":""},{"$f":"IF(B7=0,\"\",Daten!B$16)","v":""},{"$f":"IF(B7=0,\"\",IF(Daten!B$1=TRUE,Daten!B$17,\"-\"))","v":""},{"$f":"IF(B7=0,\"\",IF(C7=\"Nein\",\"-\",Daten!D$7))","v":""},{"$f":"IF(B7=\"\",\"\",IF(C7=\"Nein\",\"-\",IF(T$1=0,\"\",Daten!D$12)))","v":""},{"$f":"IF(B7=\"\",\"\",IF(C7=\"Nein\",\"-\",IF(T$1=0,\"\",Daten!D$13)))","v":""},{"$f":"IF(B7=\"\",\"\",IF(C7=\"Nein\",\"-\",IF(T$1=0,\"\",IF(AK7=\"\",\"\",AK7+X7-Daten!D$20))))","v":""},{"$f":"IF(B7=0,\"\",IF(L$1=1,M7+N7,Daten!D$2))","v":""},{"$f":"IF(B7=0,\"\",IF(C7=\"Nein\",\"-\",Daten!D$6))","v":""},{"$f":"IF(B7=0,\"\",IF(C7=\"Nein\",\"-\",Daten!D$3))","v":""},{"$f":"IF(B7=0,\"\",Daten!D$4)","v":""},{"$f":"IF(B7=0,\"\",IF(C7=\"Nein\",\"-\",Daten!D$5))","v":""},{"$f":"IF(B7=0,\"\",IF(Daten!F$1=\"Keine\",Daten!A$45,IF(Daten!F$7=TRUE,Daten!A$48,Daten!A$44)))","v":""},{"$f":"IF(B7=0,\"\",IF(AB7=\"Standard\",IF(Daten!F$9=TRUE,1,0),0))","v":""},{"$f":"IFERROR(O7+AI7+AJ7,\"\")","v":""},{"$f":"IF(B7=0,\"\",IF(OR(AB7=Daten!A$46,AB7=Daten!A$47,AB7=Daten!A$48),AI7+W7,\"-\"))","v":""},{"$f":"IF(B7=0,\"\",IF(AB7=Daten!A$45,\"-\",Daten!F$5))","v":""},{"$f":"IF(B7=0,\"\",IF(AB7=Daten!A$45,\"-\",Daten!F$4))","v":""},{"$f":"IF(B7=0,\"\",IF(AB7=Daten!A$45,\"-\",Daten!F$6))","v":""},{"$f":"IF(B7=0,\"\",IF(AB7=Daten!A$45,\"-\",Daten!F$2))","v":""},{"$f":"IF(B7=0,\"\",IF(AB7=Daten!A$45,\"-\",Daten!F$3))","v":""},"",{"$f":"IF(B7=0,\"\",IF(OR(C7=\"Nein\",Daten!D9=\"Ohne\"),\"-\",Daten!D$9))","v":""},{"$f":"IF(B7=0,\"\",IF(OR(C7=\"Nein\",Daten!D9=\"Ohne\"),\"-\",IF(Daten!D$8=\"Rahmendämmung\",Daten!D$10,\"-\")))","v":""},{"$f":"IF(B7=0,\"\",IF(AND(C7=\"Ja\",Daten!D$15=TRUE),Daten!D$16,\"-\"))","v":""},{"$f":"IF(AN7=\"\",\"\",IF(AND(C7=\"Ja\",Daten!D$15=TRUE),Daten!D$18,\"-\"))","v":""},{"$f":"IF(B7=0,\"\",IF(Daten!H$7=TRUE,\"bauseits\",IF(Daten!H$8=TRUE,\"FSP 40\",\"WSP 40\")))","v":""},{"$f":"IF(B7=0,\"\",Daten!H$10)","v":""},{"$f":"IFERROR(IF(B7=0,\"\",IF(Daten!H$2=TRUE,1,0)*IF(J7+P7+P7+Q7+Q7>Daten!B$62,0,1)*IF(K7+P7+Z7+AF7+10>Daten!B$62,0,1)),0)","v":""}]
[null,null,{"$f":"IF(A8=\"\",\"\",IF(Daten!D$1<>\"Keine\",\"Ja\",\"Nein\"))","v":""},{"$f":"IF(A8=\"\",\"\",IF(Daten!B$4=TRUE,\"QB\",\"BS\")&IF(AR8=1,\"G\",\"\")&IF(C8=\"Nein\",\"-V\",IF(Daten!D$11=TRUE,\"-S\",\"-H\"))&IF(Daten!B$1=TRUE,\"-E\",\"\")&IF(Daten!F$9=TRUE,\"-B\",\"\")&IF(Daten!F$8=TRUE,\"A\",\"\"))","v":""},{"$f":"IF(A8=\"\",\"\",IFERROR(VLOOKUP(D8,Daten!D$43:G$94,2,FALSE),\"spez.\"))","v":""},null,null,null,null,{"$f":"IF(F8<>\"\",F8+(2*(Daten!B$13+2)),IF(H8<>\"\",H8-10,\"\"))","v":""},{"$f":"IFERROR(IF(G8<>\"\",G8+Daten!B$14+Daten!B$15+2+IF(AG8=\"-\",0,AG8),IF(I8<>\"\",I8-5,\"\")),\"\")","v":""},{"$f":"IF(B8=0,\"\",IF(L$1=0,0,Daten!B$10))","v":""},{"$f":"IF(B8=0,\"\",IF(M$1=0,0,Daten!B$11))","v":""},{"$f":"IF(B8=0,\"\",IF(N$1=0,0,Daten!B$12))","v":""},"",{"$f":"IF(B8=0,\"\",Daten!B$6)","v":""},{"$f":"IF(B8=0,\"\",Daten!B$16)","v":""},{"$f":"IF(B8=0,\"\",IF(Daten!B$1=TRUE,Daten!B$17,\"-\"))","v":""},{"$f":"IF(B8=0,\"\",IF(C8=\"Nein\",\"-\",Daten!D$7))","v":""},{"$f":"IF(B8=\"\",\"\",IF(C8=\"Nein\",\"-\",IF(T$1=0,\"\",Daten!D$12)))","v":""},{"$f":"IF(B8=\"\",\"\",IF(C8=\"Nein\",\"-\",IF(T$1=0,\"\",Daten!D$13)))","v":""},{"$f":"IF(B8=\"\",\"\",IF(C8=\"Nein\",\"-\",IF(T$1=0,\"\",IF(AK8=\"\",\"\",AK8+X8-Daten!D$20))))","v":""},{"$f":"IF(B8=0,\"\",IF(L$1=1,M8+N8,Daten!D$2))","v":""},{"$f":"IF(B8=0,\"\",IF(C8=\"Nein\",\"-\",Daten!D$6))","v":""},{"$f":"IF(B8=0,\"\",IF(C8=\"Nein\",\"-\",Daten!D$3))","v":""},{"$f":"IF(B8=0,\"\",Daten!D$4)","v":""},{"$f":"IF(B8=0,\"\",IF(C8=\"Nein\",\"-\",Daten!D$5))","v":""},{"$f":"IF(B8=0,\"\",IF(Daten!F$1=\"Keine\",Daten!A$45,IF(Daten!F$7=TRUE,Daten!A$48,Daten!A$44)))","v":""},{"$f":"IF(B8=0,\"\",IF(AB8=\"Standard\",IF(Daten!F$9=TRUE,1,0),0))","v":""},"",{"$f":"IF(B8=0,\"\",IF(OR(AB8=Daten!A$46,AB8=Daten!A$47,AB8=Daten!A$48),AI8+W8,\"-\"))","v":""},{"$f":"IF(B8=0,\"\",IF(AB8=Daten!A$45,\"-\",Daten!F$5))","v":""},{"$f":"IF(B8=0,\"\",IF(AB8=Daten!A$45,\"-\",Daten!F$4))","v":""},{"$f":"IF(B8=0,\"\",IF(AB8=Daten!A$45,\"-\",Daten!F$6))","v":""},{"$f":"IF(B8=0,\"\",IF(AB8=Daten!A$45,\"-\",Daten!F$2))","v":""},{"$f":"IF(B8=0,\"\",IF(AB8=Daten!A$45,\"-\",Daten!F$3))","v":""},"",{"$f":"IF(B8=0,\"\",IF(OR(C8=\"Nein\",Daten!D10=\"Ohne\"),\"-\",Daten!D$9))","v":""},{"$f":"IF(B8=0,\"\",IF(OR(C8=\"Nein\",Daten!D10=\"Ohne\"),\"-\",IF(Daten!D$8=\"Rahmendämmung\",Daten!D$10,\"-\")))","v":""},{"$f":"IF(B8=0,\"\",IF(AND(C8=\"Ja\",Daten!D$15=TRUE),Daten!D$16,\"-\"))","v":""},{"$f":"IF(AN8=\"\",\"\",IF(AND(C8=\"Ja\",Daten!D$15=TRUE),Daten!D$18,\"-\"))","v":""},{"$f":"IF(B8=0,\"\",IF(Daten!H$7=TRUE,\"bauseits\",IF(Daten!H$8=TRUE,\"FSP 40\",\"WSP 40\")))","v":""},{"$f":"IF(B8=0,\"\",Daten!H$10)","v":""},{"$f":"IFERROR(IF(B8=0,\"\",IF(Daten!H$2=TRUE,1,0)*IF(J8+P8+P8+Q8+Q8>Daten!B$62,0,1)*IF(K8+P8+Z8+AF8+10>Daten!B$62,0,1)),0)","v":""}]
[null,null,{"$f":"IF(A9=\"\",\"\",IF(Daten!D$1<>\"Keine\",\"Ja\",\"Nein\"))","v":""},{"$f":"IF(A9=\"\",\"\",IF(Daten!B$4=TRUE,\"QB\",\"BS\")&IF(AR9=1,\"G\",\"\")&IF(C9=\"Nein\",\"-V\",IF(Daten!D$11=TRUE,\"-S\",\"-H\"))&IF(Daten!B$1=TRUE,\"-E\",\"\")&IF(Daten!F$9=TRUE,\"-B\",\"\")&IF(Daten!F$8=TRUE,\"A\",\"\"))","v":""},{"$f":"IF(A9=\"\",\"\",IFERROR(VLOOKUP(D9,Daten!D$43:G$94,2,FALSE),\"spez.\"))","v":""},null,null,null,null,{"$f":"IF(F9<>\"\",F9+(2*(Daten!B$13+2)),IF(H9<>\"\",H9-10,\"\"))","v":""},{"$f":"IFERROR(IF(G9<>\"\",G9+Daten!B$14+Daten!B$15+2+IF(AG9=\"-\",0,AG9),IF(I9<>\"\",I9-5,\"\")),\"\")","v":""},{"$f":"IF(B9=0,\"\",IF(L$1=0,0,Daten!B$10))","v":""},{"$f":"IF(B9=0,\"\",IF(M$1=0,0,Daten!B$11))","v":""},{"$f":"IF(B9=0,\"\",IF(N$1=0,0,Daten!B$12))","v":""},"",{"$f":"IF(B9=0,\"\",Daten!B$6)","v":""},{"$f":"IF(B9=0,\"\",Daten!B$16)","v":""},{"$f":"IF(B9=0,\"\",IF(Daten!B$1=TRUE,Daten!B$17,\"-\"))","v":""},{"$f":"IF(B9=0,\"\",IF(C9=\"Nein\",\"-\",Daten!D$7))","v":""},{"$f":"IF(B9=\"\",\"\",IF(C9=\"Nein\",\"-\",IF(T$1=0,\"\",Daten!D$12)))","v":""},{"$f":"IF(B9=\"\",\"\",IF(C9=\"Nein\",\"-\",IF(T$1=0,\"\",Daten!D$13)))","v":""},{"$f":"IF(B9=\"\",\"\",IF(C9=\"Nein\",\"-\",IF(T$1=0,\"\",IF(AK9=\"\",\"\",AK9+X9-Daten!D$20))))","v":""},{"$f":"IF(B9=0,\"\",IF(L$1=1,M9+N9,Daten!D$2))","v":""},{"$f":"IF(B9=0,\"\",IF(C9=\"Nein\",\"-\",Daten!D$6))","v":""},{"$f":"IF(B9=0,\"\",IF(C9=\"Nein\",\"-\",Daten!D$3))","v":""},{"$f":"IF(B9=0,\"\",Daten!D$4)","v":""},{"$f":"IF(B9=0,\"\",IF(C9=\"Nein\",\"-\",Daten!D$5))","v":""},{"$f":"IF(B9=0,\"\",IF(Daten!F$1=\"Keine\",Daten!A$45,IF(Daten!F$7=TRUE,Daten!A$48,Daten!A$44)))","v":""},{"$f":"IF(B9=0,\"\",IF(AB9=\"Standard\",IF(Daten!F$9=TRUE,1,0),0))","v":""},"",{"$f":"IF(B9=0,\"\",IF(OR(AB9=Daten!A$46,AB9=Daten!A$47,AB9=Daten!A$48),AI9+W9,\"-\"))","v":""},{"$f":"IF(B9=0,\"\",IF(AB9=Daten!A$45,\"-\",Daten!F$5))","v":""},{"$f":"IF(B9=0,\"\",IF(AB9=Daten!A$45,\"-\",Daten!F$4))","v":""},{"$f":"IF(B9=0,\"\",IF(AB9=Daten!A$45,\"-\",Daten!F$6))","v":""},{"$f":"IF(B9=0,\"\",IF(AB9=Daten!A$45,\"-\",Daten!F$2))","v":""},{"$f":"IF(B9=0,\"\",IF(AB9=Daten!A$45,\"-\",Daten!F$3))","v":""},"",{"$f":"IF(B9=0,\"\",IF(OR(C9=\"Nein\",Daten!D11=\"Ohne\"),\"-\",Daten!D$9))","v":""},{"$f":"IF(B9=0,\"\",IF(OR(C9=\"Nein\",Daten!D11=\"Ohne\"),\"-\",IF(Daten!D$8=\"Rahmendämmung\",Daten!D$10,\"-\")))","v":""},{"$f":"IF(B9=0,\"\",IF(AND(C9=\"Ja\",Daten!D$15=TRUE),Daten!D$16,\"-\"))","v":""},{"$f":"IF(AN9=\"\",\"\",IF(AND(C9=\"Ja\",Daten!D$15=TRUE),Daten!D$18,\"-\"))","v":""},{"$f":"IF(B9=0,\"\",IF(Daten!H$7=TRUE,\"bauseits\",IF(Daten!H$8=TRUE,\"FSP 40\",\"WSP 40\")))","v":""},{"$f":"IF(B9=0,\"\",Daten!H$10)","v":""},{"$f":"IFERROR(IF(B9=0,\"\",IF(Daten!H$2=TRUE,1,0)*IF(J9+P9+P9+Q9+Q9>Daten!B$62,0,1)*IF(K9+P9+Z9+AF9+10>Daten!B$62,0,1)),0)","v":""}]
[null,null,{"$f":"IF(A10=\"\",\"\",IF(Daten!D$1<>\"Keine\",\"Ja\",\"Nein\"))","v":""},{"$f":"IF(A10=\"\",\"\",IF(Daten!B$4=TRUE,\"QB\",\"BS\")&IF(AR10=1,\"G\",\"\")&IF(C10=\"Nein\",\"-V\",IF(Daten!D$11=TRUE,\"-S\",\"-H\"))&IF(Daten!B$1=TRUE,\"-E\",\"\")&IF(Daten!F$9=TRUE,\"-B\",\"\")&IF(Daten!F$8=TRUE,\"A\",\"\"))","v":""},{"$f":"IF(A10=\"\",\"\",IFERROR(VLOOKUP(D10,Daten!D$43:G$94,2,FALSE),\"spez.\"))","v":""},null,null,null,null,{"$f":"IF(F10<>\"\",F10+(2*(Daten!B$13+2)),IF(H10<>\"\",H10-10,\"\"))","v":""},{"$f":"IFERROR(IF(G10<>\"\",G10+Daten!B$14+Daten!B$15+2+IF(AG10=\"-\",0,AG10),IF(I10<>\"\",I10-5,\"\")),\"\")","v":""},{"$f":"IF(B10=0,\"\",IF(L$1=0,0,Daten!B$10))","v":""},{"$f":"IF(B10=0,\"\",IF(M$1=0,0,Daten!B$11))","v":""},{"$f":"IF(B10=0,\"\",IF(N$1=0,0,Daten!B$12))","v":""},"",{"$f":"IF(B10=0,\"\",Daten!B$6)","v":""},{"$f":"IF(B10=0,\"\",Daten!B$16)","v":""},{"$f":"IF(B10=0,\"\",IF(Daten!B$1=TRUE,Daten!B$17,\"-\"))","v":""},{"$f":"IF(B10=0,\"\",IF(C10=\"Nein\",\"-\",Daten!D$7))","v":""},{"$f":"IF(B10=\"\",\"\",IF(C10=\"Nein\",\"-\",IF(T$1=0,\"\",Daten!D$12)))","v":""},{"$f":"IF(B10=\"\",\"\",IF(C10=\"Nein\",\"-\",IF(T$1=0,\"\",Daten!D$13)))","v":""},{"$f":"IF(B10=\"\",\"\",IF(C10=\"Nein\",\"-\",IF(T$1=0,\"\",IF(AK10=\"\",\"\",AK10+X10-Daten!D$20))))","v":""},{"$f":"IF(B10=0,\"\",IF(L$1=1,M10+N10,Daten!D$2))","v":""},{"$f":"IF(B10=0,\"\",IF(C10=\"Nein\",\"-\",Daten!D$6))","v":""},{"$f":"IF(B10=0,\"\",IF(C10=\"Nein\",\"-\",Daten!D$3))","v":""},{"$f":"IF(B10=0,\"\",Daten!D$4)","v":""},{"$f":"IF(B10=0,\"\",IF(C10=\"Nein\",\"-\",Daten!D$5))","v":""},{"$f":"IF(B10=0,\"\",IF(Daten!F$1=\"Keine\",Daten!A$45,IF(Daten!F$7=TRUE,Daten!A$48,Daten!A$44)))","v":""},{"$f":"IF(B10=0,\"\",IF(AB10=\"Standard\",IF(Daten!F$9=TRUE,1,0),0))","v":""},"",{"$f":"IF(B10=0,\"\",IF(OR(AB10=Daten!A$46,AB10=Daten!A$47,AB10=Daten!A$48),AI10+W10,\"-\"))","v":""},{"$f":"IF(B10=0,\"\",IF(AB10=Daten!A$45,\"-\",Daten!F$5))","v":""},{"$f":"IF(B10=0,\"\",IF(AB10=Daten!A$45,\"-\",Daten!F$4))","v":""},{"$f":"IF(B10=0,\"\",IF(AB10=Daten!A$45,\"-\",Daten!F$6))","v":""},{"$f":"IF(B10=0,\"\",IF(AB10=Daten!A$45,\"-\",Daten!F$2))","v":""},{"$f":"IF(B10=0,\"\",IF(AB10=Daten!A$45,\"-\",Daten!F$3))","v":""},"",{"$f":"IF(B10=0,\"\",IF(OR(C10=\"Nein\",Daten!D12=\"Ohne\"),\"-\",Daten!D$9))","v":""},{"$f":"IF(B10=0,\"\",IF(OR(C10=\"Nein\",Daten!D12=\"Ohne\"),\"-\",IF(Daten!D$8=\"Rahmendämmung\",Daten!D$10,\"-\")))","v":""},{"$f":"IF(B10=0,\"\",IF(AND(C10=\"Ja\",Daten!D$15=TRUE),Daten!D$16,\"-\"))","v":""},{"$f":"IF(AN10=\"\",\"\",IF(AND(C10=\"Ja\",Daten!D$15=TRUE),Daten!D$18,\"-\"))","v":""},{"$f":"IF(B10=0,\"\",IF(Daten!H$7=TRUE,\"bauseits\",IF(Daten!H$8=TRUE,\"FSP 40\",\"WSP 40\")))","v":""},{"$f":"IF(B10=0,\"\",Daten!H$10)","v":""},{"$f":"IFERROR(IF(B10=0,\"\",IF(Daten!H$2=TRUE,1,0)*IF(J10+P10+P10+Q10+Q10>Daten!B$62,0,1)*IF(K10+P10+Z10+AF10+10>Daten!B$62,0,1)),0)","v":""}]
{"$rows_left_out":97}
{"sheet":"Daten","index":2,"n_rows":72,"n_cols":13,"rows_kept":72,"cut":false,"hidden":true,"merged":[]}
["Entwässerung",true,"Storenöffnung","Keine","Fensterbank?","Keine","Gesteckt",true,"Dichtunsband",false,"Firma","Firmenname"]
["Keine Entw.",false,"ST",60,"Ue",10,"Geschweisst",false,"Dichtungsband",null,"Ansprechperson"]
[null,null,"AS",3,"VFB",0,"Beschrieb","Gesteckte Ausführung - der FEBA-Standard: Preiswert, rasch Verfügbar, günstige Lieferung","Flex 290",false,"Telefonnummer","Telefonnummer"]
["Quetschbug",true,"HS2",35,"Ha",12,"Oberfläche","Pulverbeschichtet RAL","Flex 290",null,"Objekt"]
["Spiegel",false,"HS1",20,"Va",50,"Farbton","Farbton?","Flex 600",false,"Wunschtermin","??.??.??"]
["BS",7,"SL",135,"Gefälle",5,"Matt",false,"Flex 600",null,"Lieferadresse","Lieferadresse"]
["Direkte Masseing.",true,"LH",50,"Streifbank?",false,"Bauseits?",false,"PU 310",false,"Bemerkung"]
["Ausmass Fenster",false,"RD?",null,"Ausschnitt?",false,"Flachsteck?",true,"Pu 310",null,"Montage",false,{"$f":"IF(L8=FALSE,\"OHNE Montage\",\"MIT Montage\")","v":"OHNE Montage"}]
["Ausmass Futter",false,"RV",50,"FB geschl.?",false,"Winkelsteck?",false,"7.5x50",null,"Lieferart","ab Werk"]
["C","??","RH",null,"Streifbank A",null,"LSP",10,"7.5x50",false,"Ausmass",false,{"$f":"IF(L10=FALSE,\"OHNE Ausmass\",\"MIT Ausmass\")","v":"OHNE Ausmass"}]
{"$rows_left_out":62}